Cyclopentene,1-hexyl-
- Formula: C11H20
- Molecular weight: 152.2765
- IUPAC Standard InChIKey: ZLWJQGUXFYXEPE-UHFFFAOYSA-N
- CAS Registry Number: 4291-99-0
- Chemical structure:
View 3d structure (requires JavaScript / HTML 5) - Other names: 1-Hexylcyclopentene; 1-Hexyl-1-cyclopentene

Gas phase ion energetics data

Data compiled by: Sharon G. Lias, Rhoda D. Levin, and Sherif A. Kafafi
Ionization energy determinations
IE (eV) | Method | Reference |
---|---|---|
8.43 ± 0.01 | PE | Rang, Paldoia, et al., 1974 |

Kovats' RI, non-polar column, isothermal

Column type | Active phase | Temperature (C) | I | Reference | Comment |
---|---|---|---|---|---|
Capillary | Squalane | 100. | 1135. | Rang, Orav, et al., 1977 | Nitrogen or helium; Column length: 100. m; Column diameter: 0.25 mm |

Kovats' RI, polar column, isothermal

Column type | Active phase | Temperature (C) | I | Reference | Comment |
---|---|---|---|---|---|
Capillary | PEG 4000 | 100. | 1263. | Rang, Orav, et al., 1988 | |
Capillary | PEG 4000 | 110. | 1266. | Rang, Orav, et al., 1988 | |
Capillary | PEG 4000 | 120. | 1270. | Rang, Orav, et al., 1988 | |
Capillary | PEG 4000 | 150. | 1282. | Rang, Orav, et al., 1988 | |
Capillary | PEG 4000 | 80. | 1255. | Rang, Orav, et al., 1988 | |
Capillary | PEG-20M | 100. | 1252. | Rang, Orav, et al., 1988 | |
Capillary | PEG-20M | 110. | 1256. | Rang, Orav, et al., 1988 | |
Capillary | PEG-20M | 120. | 1259. | Rang, Orav, et al., 1988 | |
Capillary | PEG-20M | 130. | 1263. | Rang, Orav, et al., 1988 | |
Capillary | PEG-20M | 140. | 1266. | Rang, Orav, et al., 1988 | |
Capillary | PEG-20M | 80. | 1244. | Rang, Orav, et al., 1988 | |
Capillary | PEG-20M | 90. | 1248. | Rang, Orav, et al., 1988 | |
Capillary | PEG-20M | 100. | 1252. | Orav, Kuningas, et al., 1982 | He; Column length: 100. m; Column diameter: 0.25 mm |
Capillary | PEG-20M | 110. | 1255.7 | Orav, Kuningas, et al., 1982 | He; Column length: 100. m; Column diameter: 0.25 mm |
Capillary | PEG-20M | 120. | 1259.3 | Orav, Kuningas, et al., 1982 | He; Column length: 100. m; Column diameter: 0.25 mm |
Capillary | PEG-20M | 130. | 1262.9 | Orav, Kuningas, et al., 1982 | He; Column length: 100. m; Column diameter: 0.25 mm |
Capillary | PEG-20M | 140. | 1266. | Orav, Kuningas, et al., 1982 | He; Column length: 100. m; Column diameter: 0.25 mm |
Capillary | PEG-20M | 80. | 1244.2 | Orav, Kuningas, et al., 1982 | He; Column length: 100. m; Column diameter: 0.25 mm |
Capillary | PEG-20M | 90. | 1248.2 | Orav, Kuningas, et al., 1982 | He; Column length: 100. m; Column diameter: 0.25 mm |
Capillary | PEG 4000 | 100. | 1263. | Rang, Orav, et al., 1977 | Nitrogen or Helium; Column length: 45. m; Column diameter: 0.25 mm |

Kovats' RI, polar column, temperature ramp

Column type | Active phase | I | Reference | Comment |
---|---|---|---|---|
Capillary | DB-Wax | 1217. | Umano and Shibamoto, 1987 | He, 40. C @ 10. min, 2. K/min; Column length: 60. m; Column diameter: 0.25 mm; Tend: 200. C |

Normal alkane RI, non-polar column, temperature ramp

Column type | Active phase | I | Reference | Comment |
---|---|---|---|---|
Capillary | SP-2100 | 1137. | Alencar, Alves, et al., 1983 | He, 4. K/min; Column length: 30. m; Column diameter: 0.25 mm; Tstart: 40. C; Tend: 250. C |

Normal alkane RI, non-polar column, custom temperature program

Column type | Active phase | I | Reference | Comment |
---|---|---|---|---|
Capillary | Squalane | 1129. | Chen, 2008 | Program: not specified |

References

Rang, Paldoia, et al., 1974
Rang, S.; Paldoia, P.; Talvari, A.,
Ionization potentials of unsaturated hydrocarbons. 2. Mono-substituted cyclopentenes and cyclohexenes,
Eesti. NSV Tead. Akad. Toim., 1974, 354. [all data]