Stannane, diethyldimethyl-
- Formula: C6H16Sn
- Molecular weight: 206.901
- IUPAC Standard InChIKey: KQEIOCQUCGCMHX-UHFFFAOYSA-N
- CAS Registry Number: 4282-05-7
- Chemical structure:
View 3d structure (requires JavaScript / HTML 5) - Permanent link for this species. Use this link for bookmarking this species for future reference.

Condensed phase thermochemistry data

Data compiled by: José A. Martinho Simões
Quantity | Value | Units | Method | Reference | Comment |
---|---|---|---|---|---|
ΔfH°liquid | -117. ± 21. | kJ/mol | Review | Martinho Simões | |
Quantity | Value | Units | Method | Reference | Comment |
ΔcH°liquid | -5109. ± 21. | kJ/mol | CC-SB | Dillard, McNeill, et al., 1958 |

Gas phase ion energetics data

Data compiled by: Sharon G. Lias, Rhoda D. Levin, and Sherif A. Kafafi
Ionization energy determinations
IE (eV) | Method | Reference | Comment |
---|---|---|---|
9.01 | PE | Kochi, 1980 | Vertical value |

References

Martinho Simões
Martinho Simões, J.A.,
Private communication (see http://webbook.nist.gov/chemistry/om/). [all data]
Dillard, McNeill, et al., 1958
Dillard, C.R.; McNeill, E.H.; Simmons, D.E.; Yeldell, J.B.,
J. Am. Chem. Soc., 1958, 80, 3607. [all data]
Kochi, 1980
Kochi, J.K.,
The role of electron transfer and charge transfer in organometallic chemistry,
Pure Appl. Chem., 1980, 52, 571. [all data]