Ethynyloxybenzene
- Formula: C8H6O
- Molecular weight: 118.1326
- IUPAC Standard InChIKey: HJCNOCJDGPFRNM-UHFFFAOYSA-N
- CAS Registry Number: 4279-76-9
- Chemical structure:
View 3d structure (requires JavaScript / HTML 5) - Permanent link for this species. Use this link for bookmarking this species for future reference.

Gas phase ion energetics data

Data compiled as indicated in comments:
LLK - Sharon G. Lias, Rhoda D. Levin, and Sherif A. Kafafi
RDSH - Henry M. Rosenstock, Keith Draxl, Bruce W. Steiner, and John T. Herron
Appearance energy determinations
Ion | AE (eV) | Other Products | Method | Reference | Comment |
---|---|---|---|---|---|
C6H5+ | 12.2 ± 0.1 | ? | EI | Coats and Anderson, 1957 | RDSH |
C6H5O+ | 9.5 ± 0.1 | C2H | EI | Coats and Anderson, 1957 | RDSH |
C8H6O+ | 8.7 | ? | EI | Tang, McGowan, et al., 1979 | LLK |

References

Coats and Anderson, 1957
Coats, F.H.; Anderson, R.C.,
Thermodynamic data from electron-impact measurements on acetylene and substituted acetylenes,
J. Am. Chem. Soc., 1957, 79, 1340. [all data]
Tang, McGowan, et al., 1979
Tang, S.-Y.; McGowan, J.C.; Singh, M.; Galatsis, P.; Ellis, B.E.; Boyd, R.K.; Brown, S.A.,
Mass spectrometry of some furanocoumarins,
Can. J. Chem., 1979, 57, 1995. [all data]