4H-1,2,4-Triazol-3-amine, 4-ethyl-
- Formula: C4H8N4
- Molecular weight: 112.1331
- IUPAC Standard InChIKey: OTXAZICPXWFRME-UHFFFAOYSA-N
- CAS Registry Number: 42786-06-1
- Chemical structure:
View 3d structure (requires JavaScript / HTML 5) - Other names: 4H-1,2,4-Triazole, 3-amino-4-ethyl-

Gas phase ion energetics data

Data compiled by: Sharon G. Lias, Rhoda D. Levin, and Sherif A. Kafafi
Ionization energy determinations
IE (eV) | Method | Reference |
---|---|---|
8.3 | EI | Maquestiau, Van Haverbeke, et al., 1975 |
Appearance energy determinations
Ion | AE (eV) | Other Products | Method | Reference | Comment |
---|---|---|---|---|---|
C2H4N4+ | 10.2 | C2H4 | EI | Maquestiau, Van Haverbeke, et al., 1975 |

References

Maquestiau, Van Haverbeke, et al., 1975
Maquestiau, A.; Van Haverbeke, Y.; Flammang, R.; Cooks, R.G.,
Fragmentation d'azoles sous l'impact electronique,
Org. Mass Spectrom., 1975, 10, 946. [all data]