Ethanol, 2,2'-thiobis-, diacetate
- Formula: C8H14O4S
- Molecular weight: 206.259
- IUPAC Standard InChIKey: HWLINJPYLXLANY-UHFFFAOYSA-N
- CAS Registry Number: 4275-28-9
- Chemical structure:
View 3d structure (requires JavaScript / HTML 5) - Other names: Acetic acid, thiodiethylene ester; Ethanol, 2,2'-thiodi-, diacetate; 2,2'-Thiodiethanol diacetate; Bis(β-thioethyl acetate); 2,2'-thiodiethyl diacetate

Phase change data

Data compiled by: Thermodynamics Research Center, NIST Boulder Laboratories, Chris Muzny director
Quantity | Value | Units | Method | Reference | Comment |
---|---|---|---|---|---|
Tfus | 251.1 | K | N/A | Anonymous, 1958 | Uncertainty assigned by TRC = 0.6 K |

References

Anonymous, 1958
Anonymous, R.,
, Am. Pet. Inst. Res. Proj. 45, Ohio State Univ., 1958. [all data]