p,p-Dimethylphosphine-borane
- Formula: C2H10BP
- Molecular weight: 75.886
- IUPAC Standard InChIKey: WNEJLZDEDLSCQY-UHFFFAOYSA-N
- CAS Registry Number: 4268-35-3
- Chemical structure:
View 3d structure (requires JavaScript / HTML 5) - Permanent link for this species. Use this link for bookmarking this species for future reference.

Phase change data

Data compiled by: William E. Acree, Jr., James S. Chickos
Enthalpy of vaporization
ΔvapH (kJ/mol) | Temperature (K) | Reference | Comment |
---|---|---|---|
45.1 | 318. | Herington and Martin, 1953 | Based on data from 303. to 383. K. |

Gas phase ion energetics data

Data compiled by: Sharon G. Lias, John E. Bartmess, Joel F. Liebman, John L. Holmes, Rhoda D. Levin, and W. Gary Mallard
Ionization energy determinations
IE (eV) | Method | Reference | Comment |
---|---|---|---|
10.18 | PE | Cowley, Kemp, et al., 1982 | Vertical value |

References

Herington and Martin, 1953
Herington, E.F.G.; Martin, J.F.,
Vapour pressures of pyridine and its homologues,
Trans. Faraday Soc., 1953, 49, 154, https://doi.org/10.1039/tf9534900154
. [all data]
Cowley, Kemp, et al., 1982
Cowley, A.H.; Kemp, R.A.; Lattman, M.; McKee, M.L.,
Lewis base behavior of methylated and fluorinated phosphines. A photoelectron spectroscopic investigation,
Inorg. Chem., 1982, 21, 85. [all data]