Chlorophyll a

Gas phase ion energetics data

Data compiled by: Sharon G. Lias, Rhoda D. Levin, and Sherif A. Kafafi

Ionization energy determinations

IE (eV) Method Reference
6.1 ± 0.2LENakato, Chiyoda, et al., 1974

References

Nakato, Chiyoda, et al., 1974
Nakato, Y.; Chiyoda, T.; Tsubomura, H., Experimental determination of ionization potentials of organic amines, β-carotene and chlorophyll a, Bull. Chem. Soc. Jpn., 1974, 47, 3001. [all data]

Anderson and Calvin, 1964
Anderson, A.F.H.; Calvin, M., Arch. Biochem. Biophis., 1964, 107, 251. [all data]