Dimagnesium tetrachloride
- Formula: Cl4Mg2
- Molecular weight: 190.422
- CAS Registry Number: 42565-93-5

Gas phase thermochemistry data

Quantity | Value | Units | Method | Reference | Comment |
---|---|---|---|---|---|
ΔfH°gas | -954.37 | kJ/mol | Review | Chase, 1998 | Data last reviewed in December, 1969 |
Quantity | Value | Units | Method | Reference | Comment |
S°gas,1 bar | 418.91 | J/mol*K | Review | Chase, 1998 | Data last reviewed in December, 1969 |
Gas Phase Heat Capacity (Shomate Equation)
Cp° = A + B*t + C*t2 + D*t3 +
E/t2
H° − H°298.15= A*t + B*t2/2 +
C*t3/3 + D*t4/4 − E/t + F − H
S° = A*ln(t) + B*t + C*t2/2 + D*t3/3 −
E/(2*t2) + G
Cp = heat capacity (J/mol*K)
H° = standard enthalpy (kJ/mol)
S° = standard entropy (J/mol*K)
t = temperature (K) / 1000.
View plot Requires a JavaScript / HTML 5 canvas capable browser.
Temperature (K) | 298. to 6000. |
---|---|
A | 132.4073 |
B | 0.532464 |
C | -0.144308 |
D | 0.012314 |
E | -0.804420 |
F | -996.5702 |
G | 574.4632 |
H | -954.3704 |
Reference | Chase, 1998 |
Comment | Data last reviewed in December, 1969 |

Gas phase ion energetics data

Data compiled by: Henry M. Rosenstock, Keith Draxl, Bruce W. Steiner, and John T. Herron
Appearance energy determinations
Ion | AE (eV) | Other Products | Method | Reference | Comment |
---|---|---|---|---|---|
Mg2Cl3+ | 11.2 ± 0.3 | Cl | EI | Berkowitz and Marquart, 1962 |

References

Chase, 1998
Chase, M.W., Jr.,
NIST-JANAF Themochemical Tables, Fourth Edition,
J. Phys. Chem. Ref. Data, Monograph 9, 1998, 1-1951. [all data]
Berkowitz and Marquart, 1962
Berkowitz, J.; Marquart, J.R.,
Mass-spectrometric study of the magnesium halides,
J. Chem. Phys., 1962, 37, 1853. [all data]