Indeno[1,2-b]azirin-6(1H)-one,1a,6a-dihydro-1-phenyl-
- Formula: C15H11NO
- Molecular weight: 221.2539
- IUPAC Standard InChIKey: HATOMYJZQZPKIE-UHFFFAOYSA-N
- CAS Registry Number: 42299-62-7
- Chemical structure:
View 3d structure (requires JavaScript / HTML 5) - Permanent link for this species. Use this link for bookmarking this species for future reference.

Gas phase ion energetics data

Data compiled by: Sharon G. Lias, Rhoda D. Levin, and Sherif A. Kafafi
Ionization energy determinations
IE (eV) | Method | Reference |
---|---|---|
8.13 ± 0.05 | EI | Hansen and Undheim, 1975 |

References

Hansen and Undheim, 1975
Hansen, P.E.; Undheim, K.,
Mass spectrometry of onium compounds. XXIX. Ionisation potential in structure analysis of valence isomers,
Acta Chem. Scand., Ser. B, 1975, 29, 221. [all data]