2,4-Azetidinedione, 3,3-diethyl-
- Formula: C7H11NO2
- Molecular weight: 141.1677
- IUPAC Standard InChIKey: OQYOLDLENQHHFM-UHFFFAOYSA-N
- CAS Registry Number: 42282-85-9
- Chemical structure:
View 3d structure (requires JavaScript / HTML 5) - Other names: Malonimide, 2,2-diethyl-; 3,3-Diethylazetidin-2,4-dione

Gas phase ion energetics data

Data compiled by: Sharon G. Lias, Rhoda D. Levin, and Sherif A. Kafafi
Ionization energy determinations
IE (eV) | Method | Reference |
---|---|---|
9.57 | EI | Compernolle and DeSchryver, 1975 |
Appearance energy determinations
Ion | AE (eV) | Other Products | Method | Reference | Comment |
---|---|---|---|---|---|
C6H10O+ | 9.60 | ? | EI | Compernolle and DeSchryver, 1975 |

References

Compernolle and DeSchryver, 1975
Compernolle, F.; DeSchryver, F.,
Nonconcerted cycloreversion by electron impact of substituted 2,4-azetidinediones. Relations between the mass spectral and photochemical reactions,
J. Am. Chem. Soc., 1975, 97, 3909. [all data]