2,4-Azetidinedione, 3-ethyl-3-phenyl-
- Formula: C11H11NO2
- Molecular weight: 189.2105
- IUPAC Standard InChIKey: DBNSSSWQTICKIC-UHFFFAOYSA-N
- CAS Registry Number: 42282-82-6
- Chemical structure:
View 3d structure (requires JavaScript / HTML 5) - Other names: Malonimide, 2-ethyl-2-phenyl-; 3-Ethyl-3-phenylazetidin-2,4-dione

Gas phase ion energetics data

Data compiled by: Sharon G. Lias, Rhoda D. Levin, and Sherif A. Kafafi
Ionization energy determinations
IE (eV) | Method | Reference |
---|---|---|
8.90 | EI | Compernolle and DeSchryver, 1975 |
Appearance energy determinations
Ion | AE (eV) | Other Products | Method | Reference | Comment |
---|---|---|---|---|---|
C10H10O+ | 8.97 | HNCO | EI | Compernolle and DeSchryver, 1975 |

References

Compernolle and DeSchryver, 1975
Compernolle, F.; DeSchryver, F.,
Nonconcerted cycloreversion by electron impact of substituted 2,4-azetidinediones. Relations between the mass spectral and photochemical reactions,
J. Am. Chem. Soc., 1975, 97, 3909. [all data]