Methyl zinc
- Formula: CH3Zn
- Molecular weight: 80.41
- IUPAC Standard InChIKey: BQWIWXUEEOBUTH-UHFFFAOYSA-N
- CAS Registry Number: 42217-98-1
- Chemical structure:
View 3d structure (requires JavaScript / HTML 5) - Permanent link for this species. Use this link for bookmarking this species for future reference.

Gas phase ion energetics data

Data compiled as indicated in comments:
LL - Sharon G. Lias and Joel F. Liebman
Quantity | Value | Units | Method | Reference | Comment |
---|---|---|---|---|---|
ΔfH°(+) ion | 891. | kJ/mol | N/A | N/A |
Ionization energy determinations
IE (eV) | Method | Reference | Comment |
---|---|---|---|
7.2 | DER | Lias, Bartmess, et al., 1988 | LL |

Gas phase thermochemistry data

Data compiled by: José A. Martinho Simões
Quantity | Value | Units | Method | Reference | Comment |
---|---|---|---|---|---|
ΔfH°gas | 45.5 ± 4.0 | kcal/mol | Review | Martinho Simões | The enthalpy of formation relies on 12.6 ± 0.31 kcal/mol for the enthalpy of formation of Zn(Me)2(g). |
ΔfH°gas | 43.5 to 48.8 | kcal/mol | Review | Martinho Simões | The enthalpy of formation limits rely on 12.6 ± 0.31 kcal/mol for the enthalpy of formation of Zn(Me)2(g). |
ΔfH°gas | 41.2 ± 1.6 | kcal/mol | Review | Martinho Simões | The enthalpy of formation relies on 12.6 ± 0.31 kcal/mol for the enthalpy of formation of Zn(Me)2(g). |

Reaction thermochemistry data

Data compiled by: José A. Martinho Simões
Individual Reactions
By formula: C2H6Zn (g) = CH3Zn (g) + CH4 (g)
Quantity | Value | Units | Method | Reference | Comment |
---|---|---|---|---|---|
ΔrH° | 63.7 ± 1.5 | kcal/mol | KinG | Jackson, 1989 | |
ΔrH° | 66.0 to 71.2 | kcal/mol | N/A | Smith and Patrick, 1983 | |
ΔrH° | 68.0 ± 4.0 | kcal/mol | N/A | McMillen and Golden, 1982 |

References

Lias, Bartmess, et al., 1988
Lias, S.G.; Bartmess, J.E.; Liebman, J.F.; Holmes, J.L.; Levin, R.D.; Mallard, W.G.,
Gas-phase ion and neutral thermochemistry,
J. Phys. Chem. Ref. Data, Suppl. 1, 1988, 17, 1-861. [all data]