Methanesulfenyl chloride, trifluoro-
- Formula: CClF3S
- Molecular weight: 136.524
- IUPAC Standard InChIKey: RQYLOOVORNJDQX-UHFFFAOYSA-N
- CAS Registry Number: 421-17-0
- Chemical structure:
View 3d structure (requires JavaScript / HTML 5) - Other names: Perfluoromethylsulfenyl chloride; Trifluoromethanesulfenyl chloride; Trifluoromethylsulfenyl chloride; trifluoromethanesulphenyl chloride

Phase change data

Data compiled by: William E. Acree, Jr., James S. Chickos
Enthalpy of vaporization
ΔvapH (kJ/mol) | Temperature (K) | Method | Reference | Comment |
---|---|---|---|---|
24.5 | 260. | A | Stephenson and Malanowski, 1987 | Based on data from 247. to 272. K. See also Dykyj, Svoboda, et al., 1999. |

Gas phase ion energetics data

Data compiled by: Henry M. Rosenstock, Keith Draxl, Bruce W. Steiner, and John T. Herron
Ionization energy determinations
IE (eV) | Method | Reference |
---|---|---|
10.7 ± 0.1 | EI | Cullen, Frost, et al., 1969 |

References

Stephenson and Malanowski, 1987
Stephenson, Richard M.; Malanowski, Stanislaw,
Handbook of the Thermodynamics of Organic Compounds, 1987, https://doi.org/10.1007/978-94-009-3173-2
. [all data]
Dykyj, Svoboda, et al., 1999
Dykyj, J.; Svoboda, J.; Wilhoit, R.C.; Frenkel, M.L.; Hall, K.R.,
Vapor Pressure of Chemicals: Part A. Vapor Pressure and Antoine Constants for Hydrocarbons and Sulfur, Selenium, Tellurium and Hydrogen Containing Organic Compounds, Springer, Berlin, 1999, 373. [all data]
Cullen, Frost, et al., 1969
Cullen, W.R.; Frost, D.C.; Vroom, D.A.,
Ionization potentials of some sulfur compounds,
Inorg. Chem., 1969, 8, 1803. [all data]