Mercury, iodo(trifluoromethyl)-

Gas phase ion energetics data

Data compiled by: Sharon G. Lias, Rhoda D. Levin, and Sherif A. Kafafi

Ionization energy determinations

IE (eV) Method Reference Comment
9.89PEWittel, Bock, et al., 1975Vertical value

References

Wittel, Bock, et al., 1975
Wittel, K.; Bock, H.; Haas, A.; Pflegler, K.H., Photoelectron spectra and molecular properties XLVII. F3C-substituted mercury compounds, J. Electron Spectrosc. Relat. Phenom., 1975, 7, 365. [all data]