Propane, 1,1,1-trifluoro-
- Formula: C3H5F3
- Molecular weight: 98.0670
- IUPAC Standard InChIKey: KDWQLICBSFIDRM-UHFFFAOYSA-N
- CAS Registry Number: 421-07-8
- Chemical structure:
View 3d structure (requires JavaScript / HTML 5) - Other names: CH3CH2CF3; 1,1,1-trifluoropropane

Reaction thermochemistry data

Data compiled by: John E. Bartmess
Individual Reactions
C3H4F3- + =
By formula: C3H4F3- + H+ = C3H5F3
Quantity | Value | Units | Method | Reference | Comment |
---|---|---|---|---|---|
ΔrH° | 1699. ± 15. | kJ/mol | CIDT | Graul and Squires, 1990 | gas phase |
ΔrH° | <1686.2 | kJ/mol | CIDT | Graul and Squires, 1988 | gas phase |
Quantity | Value | Units | Method | Reference | Comment |
ΔrG° | 1667. ± 15. | kJ/mol | H-TS | Graul and Squires, 1990 | gas phase |

Gas phase ion energetics data

Data compiled as indicated in comments:
B - John E. Bartmess
RDSH - Henry M. Rosenstock, Keith Draxl, Bruce W. Steiner, and John T. Herron
Appearance energy determinations
Ion | AE (eV) | Other Products | Method | Reference | Comment |
---|---|---|---|---|---|
CF3+ | 14.8 ± 0.1 | ? | EI | Steele and Stone, 1962 | RDSH |
CHF2+ | 15.9 ± 0.1 | ? | EI | Steele and Stone, 1962 | RDSH |
CH2F+ | 15.7 ± 0.3 | ? | EI | Steele and Stone, 1962 | RDSH |
C2H3+ | 15.3 ± 0.1 | ? | EI | Steele and Stone, 1962 | RDSH |
C2H4+ | 13.0 ± 0.2 | ? | EI | Steele and Stone, 1962 | RDSH |
C2H5+ | 12.82 ± 0.02 | ? | EI | Steele and Stone, 1962 | RDSH |
C3H3F2+ | 13.6 ± 0.1 | ? | EI | Steele and Stone, 1962 | RDSH |
C3H4F+ | 15.8 ± 0.1 | ? | EI | Steele and Stone, 1962 | RDSH |
C3H4F2+ | 12.53 ± 0.04 | ? | EI | Steele and Stone, 1962 | RDSH |
C3H5F2+ | 14.9 ± 0.2 | F | EI | Steele and Stone, 1962 | RDSH |
De-protonation reactions
C3H4F3- + =
By formula: C3H4F3- + H+ = C3H5F3
Quantity | Value | Units | Method | Reference | Comment |
---|---|---|---|---|---|
ΔrH° | 1699. ± 15. | kJ/mol | CIDT | Graul and Squires, 1990 | gas phase; B |
ΔrH° | <1686.2 | kJ/mol | CIDT | Graul and Squires, 1988 | gas phase; B |
Quantity | Value | Units | Method | Reference | Comment |
ΔrG° | 1667. ± 15. | kJ/mol | H-TS | Graul and Squires, 1990 | gas phase; B |

Normal alkane RI, non-polar column, temperature ramp

Column type | Active phase | I | Reference | Comment |
---|---|---|---|---|
Capillary | OV-101 | 361. | Zenkevich, 2005 | 25. m/0.20 mm/0.10 μm, N2/He, 6. K/min; Tstart: 50. C; Tend: 250. C |

References

Graul and Squires, 1990
Graul, S.T.; Squires, R.R.,
Gas-Phase Acidities Derived from Threshold Energies for Activated Reactions,
J. Am. Chem. Soc., 1990, 112, 7, 2517, https://doi.org/10.1021/ja00163a007
. [all data]
Graul and Squires, 1988
Graul, S.T.; Squires, R.R.,
On the Existence of Alkyl Carbanions in the Gas Phase,
J. Am. Chem. Soc., 1988, 110, 2, 607, https://doi.org/10.1021/ja00210a054
. [all data]
Steele and Stone, 1962
Steele, W.C.; Stone, F.G.A.,
An electron impact study of 1,1,1-trifluoroethane, 1,1,1-trifluoropropane and 3,3,3-trifluoropropene,
J. Am. Chem. Soc., 1962, 84, 3450. [all data]
Zenkevich, 2005
Zenkevich, I.G.,
Experimentally measured retention indices., 2005. [all data]