3-Octen-1-yne, (E)-
- Formula: C8H12
- Molecular weight: 108.1809
- IUPAC Standard InChIKey: FCNAWUZWKZOHKE-FNORWQNLSA-N
- CAS Registry Number: 42104-42-7
- Chemical structure:
View 3d structure (requires JavaScript / HTML 5) - Stereoisomers:
- Other names: (E)-n-C4H9CH=CHC≡CH

Gas phase ion energetics data

Data compiled as indicated in comments:
LLK - Sharon G. Lias, Rhoda D. Levin, and Sherif A. Kafafi
Ionization energy determinations
IE (eV) | Method | Reference | Comment |
---|---|---|---|
8.87 ± 0.01 | PE | Carlier, Mouvier, et al., 1979 | LLK |

References

Carlier, Mouvier, et al., 1979
Carlier, P.; Mouvier, G.; Mesnard, D.; Miginiac, L.,
Etude par spectrometrie de photoelectrons de la structure electronique des phenyl-alcynes conjugues,
J. Electron Spectrosc. Relat. Phenom., 1979, 16, 147. [all data]