3-Octen-1-yne, (Z)-
- Formula: C8H12
- Molecular weight: 108.1809
- IUPAC Standard InChIKey: FCNAWUZWKZOHKE-ALCCZGGFSA-N
- CAS Registry Number: 42091-89-4
- Chemical structure:
View 3d structure (requires JavaScript / HTML 5) - Stereoisomers:
- Other names: Oct-1-yn-3-ene, (Z)-

Gas phase ion energetics data

Data compiled by: Sharon G. Lias, Rhoda D. Levin, and Sherif A. Kafafi
Ionization energy determinations
IE (eV) | Method | Reference |
---|---|---|
8.91 ± 0.01 | PE | Carlier, Mouvier, et al., 1979 |

References

Carlier, Mouvier, et al., 1979
Carlier, P.; Mouvier, G.; Mesnard, D.; Miginiac, L.,
Etude par spectrometrie de photoelectrons de la structure electronique des phenyl-alcynes conjugues,
J. Electron Spectrosc. Relat. Phenom., 1979, 16, 147. [all data]