Methanol-o-d1
- Formula: CH3DO
- Molecular weight: 33.0480
- IUPAC Standard InChIKey: OKKJLVBELUTLKV-MICDWDOJSA-N
- CAS Registry Number: 4206-31-9
- Chemical structure:
View 3d structure (requires JavaScript / HTML 5) - Isotopologues:

Gas phase ion energetics data

Data compiled as indicated in comments:
LLK - Sharon G. Lias, Rhoda D. Levin, and Sherif A. Kafafi
RDSH - Henry M. Rosenstock, Keith Draxl, Bruce W. Steiner, and John T. Herron
Ionization energy determinations
IE (eV) | Method | Reference | Comment |
---|---|---|---|
10.861 ± 0.002 | PE | MacNeil and Dixon, 1977 | LLK |
10.84 ± 0.02 | PI | Omura, Kaneko, et al., 1969 | RDSH |
11.13 | EI | Lifshitz, Shapiro, et al., 1969 | RDSH |
Appearance energy determinations
Ion | AE (eV) | Other Products | Method | Reference | Comment |
---|---|---|---|---|---|
CH2DO+ | 11.68 ± 0.04 | H | PI | Omura, Kaneko, et al., 1969 | RDSH |

References

MacNeil and Dixon, 1977
MacNeil, K.A.G.; Dixon, R.N.,
High-resolution photoelectron spectroscopy of methanol and its deuterated derivatives: Internal rotation in the ground ionic state,
J. Electron Spectrosc. Relat. Phenom., 1977, 11, 315. [all data]
Omura, Kaneko, et al., 1969
Omura, I.; Kaneko, T.; Yamada, Y.; Tanaka, K.,
Mass spectrometric studies of photoionization. V. Methanol and methanol-d,
J. Phys. Soc. Japan, 1969, 27, 981. [all data]
Lifshitz, Shapiro, et al., 1969
Lifshitz, C.; Shapiro, M.; Sternberg, R.,
Isotopic effects on metastable transitions. IV. Isotopic methanols,
Israel J. Chem., 1969, 7, 391. [all data]