Propane, 2,2-difluoro-
- Formula: C3H6F2
- Molecular weight: 80.0765
- IUPAC Standard InChIKey: YZXSQDNPKVBDOG-UHFFFAOYSA-N
- CAS Registry Number: 420-45-1
- Chemical structure:
View 3d structure (requires JavaScript / HTML 5) - Other names: Dimethyldifluoromethane; 2,2-Difluoropropane; (CH3)2CF2

Gas phase thermochemistry data

Data compiled by: Hussein Y. Afeefy, Joel F. Liebman, and Stephen E. Stein
Quantity | Value | Units | Method | Reference | Comment |
---|---|---|---|---|---|
ΔfH°gas | -543. ± 13. | kJ/mol | Ion | Williamson, LeBreton, et al., 1976 |

Phase change data

Data compiled as indicated in comments:
BS - Robert L. Brown and Stephen E. Stein
TRC - Thermodynamics Research Center, NIST Boulder Laboratories, Chris Muzny director
AC - William E. Acree, Jr., James S. Chickos
Quantity | Value | Units | Method | Reference | Comment |
---|---|---|---|---|---|
Tboil | 272. | K | N/A | PCR Inc., 1990 | BS |
Tboil | 272.8 | K | N/A | Henne, Renoll, et al., 1939 | Uncertainty assigned by TRC = 1. K; ~; TRC |
Enthalpy of vaporization
ΔvapH (kJ/mol) | Temperature (K) | Method | Reference | Comment |
---|---|---|---|---|
25.6 | 226. | A | Stephenson and Malanowski, 1987 | Based on data from 211. to 302. K. See also Dykyj, 1970.; AC |

Gas phase ion energetics data

Data compiled as indicated in comments:
LLK - Sharon G. Lias, Rhoda D. Levin, and Sherif A. Kafafi
Ionization energy determinations
IE (eV) | Method | Reference | Comment |
---|---|---|---|
11.42 ± 0.02 | PI | Williamson, LeBreton, et al., 1976, 2 | LLK |
Appearance energy determinations
Ion | AE (eV) | Other Products | Method | Reference | Comment |
---|---|---|---|---|---|
C2H2F2+ | 11.57 ± 0.03 | CH4 | PI | Williamson, LeBreton, et al., 1976, 2 | LLK |
C2H3F2+ | 11.81 ± 0.03 | CH3 | PI | Williamson, LeBreton, et al., 1976, 2 | LLK |

Normal alkane RI, non-polar column, temperature ramp

Column type | Active phase | I | Reference | Comment |
---|---|---|---|---|
Capillary | OV-101 | 370. | Zenkevich, 2005 | 25. m/0.20 mm/0.10 μm, N2/He, 6. K/min; Tstart: 50. C; Tend: 250. C |

References

Williamson, LeBreton, et al., 1976
Williamson, A.D.; LeBreton, P.R.; Beauchamp, J.L.,
Photoionization mass spectrometry of 2-fluoropropane and 2,2-difluoropropane. A novel determination of the proton affinity of vinyl fluoride and 1,1-difluoroethylene,
J. Am. Chem. Soc., 1976, 98, 2705-2709. [all data]
PCR Inc., 1990
PCR Inc.,
Research Chemicals Catalog 1990-1991, PCR Inc., Gainesville, FL, 1990, 1. [all data]
Henne, Renoll, et al., 1939
Henne, A.L.; Renoll, M.W.; Leicester, H.M.,
J. Am. Chem. Soc., 1939, 61, 938. [all data]
Stephenson and Malanowski, 1987
Stephenson, Richard M.; Malanowski, Stanislaw,
Handbook of the Thermodynamics of Organic Compounds, 1987, https://doi.org/10.1007/978-94-009-3173-2
. [all data]
Dykyj, 1970
Dykyj, J.,
Petrochemica, 1970, 10, 2, 51. [all data]
Williamson, LeBreton, et al., 1976, 2
Williamson, A.D.; LeBreton, P.R.; Beauchamp, J.L.,
Photoionization mass spectrometry of 2-fluoropropane and 2,2-difluoropropane. A novel determination of the proton affinity of vinyl fluoride and 1,1-difluoroethylene,
J. Am. Chem. Soc., 1976, 98, 2705. [all data]
Zenkevich, 2005
Zenkevich, I.G.,
Experimentally measured retention indices., 2005. [all data]