Arsine, (trifluoromethyl)-
- Formula: CH2AsF3
- Molecular weight: 145.9434
- IUPAC Standard InChIKey: WDIPNBNCPYIUBE-UHFFFAOYSA-N
- CAS Registry Number: 420-42-8
- Chemical structure:
View 3d structure (requires JavaScript / HTML 5) - Other names: (Trifluoromethyl)arsine

Gas phase ion energetics data

Data compiled by: Sharon G. Lias, John E. Bartmess, Joel F. Liebman, John L. Holmes, Rhoda D. Levin, and W. Gary Mallard
Ionization energy determinations
IE (eV) | Method | Reference | Comment |
---|---|---|---|
10.25 | PE | Elbel, Dieck, et al., 1982 | |
11.00 | PE | Elbel, Dieck, et al., 1982 | Vertical value |

References

Elbel, Dieck, et al., 1982
Elbel, S.; Dieck, H.T.; Demuth, R.,
Photoelectron sSpectra of group V compounds. IX. The relative perfluoroalkyl substituent effect,
J. Fluorine Chem., 1982, 19, 349. [all data]