Cyanamide
- Formula: CH2N2
- Molecular weight: 42.0400
- IUPAC Standard InChIKey: XZMCDFZZKTWFGF-UHFFFAOYSA-N
- CAS Registry Number: 420-04-2
- Chemical structure:
View 3d structure (requires JavaScript / HTML 5) - Other names: H2NCN; carbamonitrile; Amidocyanogen; Carbimide; Cyanoamine; Cyanogen nitride; Cyanogenamide; Hydrogen cyanamide; N-Cyanoamine; USAF EK-1995; Alzogur; Deurbraak; Dormex; NSC 24133; TsAKS

Condensed phase thermochemistry data

Data compiled as indicated in comments:
ALS - Hussein Y. Afeefy, Joel F. Liebman, and Stephen E. Stein
DH - Eugene S. Domalski and Elizabeth D. Hearing
Quantity | Value | Units | Method | Reference | Comment |
---|---|---|---|---|---|
ΔfH°solid | 14.05 | kcal/mol | Ccb | Salley and Gray, 1951 | correction of Salley and Gray, 1948; ALS |
Quantity | Value | Units | Method | Reference | Comment |
ΔcH°solid | -176.42 | kcal/mol | Ccb | Salley and Gray, 1951 | correction of Salley and Gray, 1948; ALS |
Constant pressure heat capacity of solid
Cp,solid (cal/mol*K) | Temperature (K) | Reference | Comment |
---|---|---|---|
18.7 | 300. | DeWit, DeKruif, et al., 1983 | T = 90 to 300 K. Linearly extrapolated.; DH |

Phase change data

Data compiled as indicated in comments:
TRC - Thermodynamics Research Center, NIST Boulder Laboratories, Chris Muzny director
AC - William E. Acree, Jr., James S. Chickos
DH - Eugene S. Domalski and Elizabeth D. Hearing
Quantity | Value | Units | Method | Reference | Comment |
---|---|---|---|---|---|
Ttriple | 318.71 | K | N/A | De Wit, De Kruif, et al., 1983 | Uncertainty assigned by TRC = 0.02 K; TRC |
Quantity | Value | Units | Method | Reference | Comment |
ΔsubH° | 18.0 | kcal/mol | N/A | De Wit, Van Miltenburg, et al., 1983 | AC |
Enthalpy of sublimation
ΔsubH (kcal/mol) | Temperature (K) | Method | Reference | Comment |
---|---|---|---|---|
18.1 | 290. | TE,ME | De Wit, Van Miltenburg, et al., 1983 | Based on data from 227. to 289. K.; AC |
Enthalpy of fusion
ΔfusH (kcal/mol) | Temperature (K) | Reference | Comment |
---|---|---|---|
1.738 | 318.71 | DeWit, DeKruif, et al., 1983 | DH |
2.09 | 317.2 | Acree, 1991 | AC |
Entropy of fusion
ΔfusS (cal/mol*K) | Temperature (K) | Reference | Comment |
---|---|---|---|
5.454 | 318.71 | DeWit, DeKruif, et al., 1983 | DH |

Reaction thermochemistry data

Data compiled by: John E. Bartmess
Individual Reactions
CHN2- + =
By formula: CHN2- + H+ = CH2N2
Quantity | Value | Units | Method | Reference | Comment |
---|---|---|---|---|---|
ΔrH° | 350.7 ± 2.3 | kcal/mol | G+TS | Koppel, Taft, et al., 1994 | gas phase; DH: 99±3, 97BOR/JI 2 |
ΔrH° | 349.2 ± 2.8 | kcal/mol | G+TS | Cacace, Depetris, et al., 1993 | gas phase |
ΔrH° | 351.9 ± 3.2 | kcal/mol | G+TS | Kroeker and Kass, 1990 | gas phase; Between tBuSH, HOAc |
Quantity | Value | Units | Method | Reference | Comment |
ΔrG° | 344.1 ± 2.0 | kcal/mol | IMRE | Koppel, Taft, et al., 1994 | gas phase; DH: 99±3, 97BOR/JI 2 |
ΔrG° | 342.6 ± 2.5 | kcal/mol | IMRE | Cacace, Depetris, et al., 1993 | gas phase |
ΔrG° | 345.3 ± 3.0 | kcal/mol | IMRB | Kroeker and Kass, 1990 | gas phase; Between tBuSH, HOAc |

Gas phase ion energetics data

Data evaluated as indicated in comments:
HL - Edward P. Hunter and Sharon G. Lias
L - Sharon G. Lias
Data compiled as indicated in comments:
B - John E. Bartmess
LL - Sharon G. Lias and Joel F. Liebman
LLK - Sharon G. Lias, Rhoda D. Levin, and Sherif A. Kafafi
Quantity | Value | Units | Method | Reference | Comment |
---|---|---|---|---|---|
IE (evaluated) | 10.4 | eV | N/A | N/A | L |
Quantity | Value | Units | Method | Reference | Comment |
Proton affinity (review) | 192.5 | kcal/mol | N/A | Hunter and Lias, 1998 | HL |
Quantity | Value | Units | Method | Reference | Comment |
Gas basicity | 185.2 | kcal/mol | N/A | Hunter and Lias, 1998 | HL |
Ionization energy determinations
IE (eV) | Method | Reference | Comment |
---|---|---|---|
10.4 | PE | Guimon, Khayar, et al., 1989 | LL |
10.4 | PE | Stafast and Bock, 1974 | LLK |
10.65 | PE | Stafast and Bock, 1974 | Vertical value; LLK |
De-protonation reactions
CHN2- + =
By formula: CHN2- + H+ = CH2N2
Quantity | Value | Units | Method | Reference | Comment |
---|---|---|---|---|---|
ΔrH° | 350.7 ± 2.3 | kcal/mol | G+TS | Koppel, Taft, et al., 1994 | gas phase; DH: 99±3, 97BOR/JI 2; B |
ΔrH° | 349.2 ± 2.8 | kcal/mol | G+TS | Cacace, Depetris, et al., 1993 | gas phase; B |
ΔrH° | 351.9 ± 3.2 | kcal/mol | G+TS | Kroeker and Kass, 1990 | gas phase; Between tBuSH, HOAc; B |
Quantity | Value | Units | Method | Reference | Comment |
ΔrG° | 344.1 ± 2.0 | kcal/mol | IMRE | Koppel, Taft, et al., 1994 | gas phase; DH: 99±3, 97BOR/JI 2; B |
ΔrG° | 342.6 ± 2.5 | kcal/mol | IMRE | Cacace, Depetris, et al., 1993 | gas phase; B |
ΔrG° | 345.3 ± 3.0 | kcal/mol | IMRB | Kroeker and Kass, 1990 | gas phase; Between tBuSH, HOAc; B |

References

Salley and Gray, 1951
Salley, D.J.; Gray, J.B.,
Heats of combustion of some organic nitrogen compounds,
J. Am. Chem. Soc., 1951, 73, 5925. [all data]
Salley and Gray, 1948
Salley, D.J.; Gray, J.B.,
Heats of combustion of some organic nitrogen compounds,
J. Am. Chem. Soc., 1948, 70, 2650-2653. [all data]
DeWit, DeKruif, et al., 1983
DeWit, H.G.M.; DeKruif, C.G.; Van Miltenburg, J.C.,
Thermodynamic properties of molecular organic crystals containing organic crystals containing nitrogen, oxygen, and sulfur. II. Molar heat capacities of eight compounds by adiabatic calorimetry,
J. Chem. Thermodynam., 1983, 15, 891-902. [all data]
De Wit, De Kruif, et al., 1983
De Wit, H.G.M.; De Kruif, C.G.; Van Miltenburg, J.C.,
Thermodynamic properties of molecular organic crystals containing nitrogen, oxygen, and sulfur II. Molar heat capacities of eight compounds by adiabatic calorimetry,
J. Chem. Thermodyn., 1983, 15, 9, 891, https://doi.org/10.1016/0021-9614(83)90095-2
. [all data]
De Wit, Van Miltenburg, et al., 1983
De Wit, H.G.M.; Van Miltenburg, J.C.; De Kruif, C.G.,
Thermodynamic properties of molecular organic crystals containing nitrogen, oxygen, and sulphur 1. Vapour pressures and enthalpies of sublimation,
The Journal of Chemical Thermodynamics, 1983, 15, 7, 651-663, https://doi.org/10.1016/0021-9614(83)90079-4
. [all data]
Acree, 1991
Acree, William E.,
Thermodynamic properties of organic compounds: enthalpy of fusion and melting point temperature compilation,
Thermochimica Acta, 1991, 189, 1, 37-56, https://doi.org/10.1016/0040-6031(91)87098-H
. [all data]
Koppel, Taft, et al., 1994
Koppel, I.A.; Taft, R.W.; Anvia, F.; Zhu, S.Z.; Hu, L.Q.; Sung, K.S.; Desmarteau, D.D.; Yagupolskii, L.M.,
The Gas-Phase Acidities of Very Strong Neutral Bronsted Acids,
J. Am. Chem. Soc., 1994, 116, 7, 3047, https://doi.org/10.1021/ja00086a038
. [all data]
Cacace, Depetris, et al., 1993
Cacace, F.; Depetris, G.; Grandinetti, F.; Occhiucci, G.,
Gas-Phase Ion Chemistry of Cyanamide - A Mass Spectrometric and Abinitio Study of Gaseous [H2N-CN]+, [H2N-CN]H+, and [HN-CN]- Ions,
J. Phys. Chem., 1993, 97, 16, 4239, https://doi.org/10.1021/j100118a048
. [all data]
Kroeker and Kass, 1990
Kroeker, R.L.; Kass, S.R.,
Diazirinyl Anion: A Cyclic 4-pi Electron System,
J. Am. Chem. Soc., 1990, 112, 24, 9024, https://doi.org/10.1021/ja00180a082
. [all data]
Hunter and Lias, 1998
Hunter, E.P.; Lias, S.G.,
Evaluated Gas Phase Basicities and Proton Affinities of Molecules: An Update,
J. Phys. Chem. Ref. Data, 1998, 27, 3, 413-656, https://doi.org/10.1063/1.556018
. [all data]
Guimon, Khayar, et al., 1989
Guimon, C.; Khayar, S.; Gracian, F.; Begtrup, M.; Pfister-Guillouzo, G.,
HeI photoelectron and theoretical study of the gas phase flash pyrolysis of tetrazole and analysis of CN2H2 energy hypersurface,
Chem. Phys., 1989, 138, 157. [all data]
Stafast and Bock, 1974
Stafast, H.; Bock, H.,
Photoelektronenspektren und Molekuleigenschaften, XXXIV. Cyanamid,
Chem. Ber., 1974, 107, 1882. [all data]