p-CH3C6H4CH:

Vibrational and/or electronic energy levels

Data compiled by: Marilyn E. Jacox

State:   ?

 Energy
 (cm-1
 Med.   Transition   λmin
 (nm)
 λmax
 (nm)

References

Td Ar 395 444 Chapman, McMahon, et al., 1984
Chapman, Johnson, et al., 1988

State:   X

Vib.
sym.
 No.   Approximate
 type of mode
 cm-1   Med.   Method   References

3073 w Ar IR Chapman, McMahon, et al., 1984
Chapman, Johnson, et al., 1988
3053 w Ar IR Chapman, McMahon, et al., 1984
Chapman, Johnson, et al., 1988
3021 w Ar IR Chapman, McMahon, et al., 1984
Chapman, Johnson, et al., 1988
2987 w Ar IR Chapman, McMahon, et al., 1984
Chapman, Johnson, et al., 1988
2957 w Ar IR Chapman, McMahon, et al., 1984
Chapman, Johnson, et al., 1988
2925 w Ar IR Chapman, McMahon, et al., 1984
Chapman, Johnson, et al., 1988
2891 w Ar IR Chapman, McMahon, et al., 1984
Chapman, Johnson, et al., 1988
2871 w Ar IR Chapman, McMahon, et al., 1984
Chapman, Johnson, et al., 1988
2847 w Ar IR Chapman, McMahon, et al., 1984
Chapman, Johnson, et al., 1988
2736 w Ar IR Chapman, McMahon, et al., 1984
Chapman, Johnson, et al., 1988
1881 w Ar IR Chapman, McMahon, et al., 1984
Chapman, Johnson, et al., 1988
1573 m Ar IR Chapman, McMahon, et al., 1984
Chapman, Johnson, et al., 1988
1522 w Ar IR Chapman, McMahon, et al., 1984
Chapman, Johnson, et al., 1988
1518 w Ar IR Chapman, McMahon, et al., 1984
Chapman, Johnson, et al., 1988
1512 w Ar IR Chapman, McMahon, et al., 1984
Chapman, Johnson, et al., 1988
1467 m Ar IR Chapman, McMahon, et al., 1984
Chapman, Johnson, et al., 1988
1454 w Ar IR Chapman, McMahon, et al., 1984
Chapman, Johnson, et al., 1988
1449 m Ar IR Chapman, McMahon, et al., 1984
Chapman, Johnson, et al., 1988
1380 w Ar IR Chapman, McMahon, et al., 1984
Chapman, Johnson, et al., 1988
1116 w Ar IR Chapman, McMahon, et al., 1984
Chapman, Johnson, et al., 1988
1089 w Ar IR Chapman, McMahon, et al., 1984
Chapman, Johnson, et al., 1988
1035 w Ar IR Chapman, McMahon, et al., 1984
Chapman, Johnson, et al., 1988
1029 w Ar IR Chapman, McMahon, et al., 1984
Chapman, Johnson, et al., 1988
1018 w Ar IR Chapman, McMahon, et al., 1984
Chapman, Johnson, et al., 1988
1000 w Ar IR Chapman, McMahon, et al., 1984
Chapman, Johnson, et al., 1988
992 w Ar IR Chapman, McMahon, et al., 1984
Chapman, Johnson, et al., 1988
983 w Ar IR Chapman, McMahon, et al., 1984
Chapman, Johnson, et al., 1988
953 w Ar IR Chapman, McMahon, et al., 1984
Chapman, Johnson, et al., 1988
948 w Ar IR Chapman, McMahon, et al., 1984
Chapman, Johnson, et al., 1988
798 s Ar IR Chapman, McMahon, et al., 1984
Chapman, Johnson, et al., 1988
779 w Ar IR Chapman, McMahon, et al., 1984
Chapman, Johnson, et al., 1988
494 w Ar IR Chapman, McMahon, et al., 1984
Chapman, Johnson, et al., 1988
446 s Ar IR Chapman, McMahon, et al., 1984
Chapman, Johnson, et al., 1988

Additional references: Jacox, 1994, page 395

Chapman, McMahon, et al., 1984
Chapman, O.L.; McMahon, R.J.; West, P.R., Rearrangements of tolylmethylenes via cycloheptatetraenes: formation of benzocyclobutene and styrene, J. Am. Chem. Soc., 1984, 106, 25, 7973, https://doi.org/10.1021/ja00337a055 . [all data]

Chapman, Johnson, et al., 1988
Chapman, O.L.; Johnson, J.W.; McMahon, R.J.; West, P.R., Rearrangements of the isomeric tolylmethylenes, J. Am. Chem. Soc., 1988, 110, 2, 501, https://doi.org/10.1021/ja00210a032 . [all data]

Jacox, 1994
Jacox, M.E., Vibrational and electronic energy levels of polyatomic transient molecules, American Chemical Society, Washington, DC, 1994, 464. [all data]