Benzenemethanol, α-ethynyl-
- Formula: C9H8O
- Molecular weight: 132.1592
- IUPAC Standard InChIKey: UIGLAZDLBZDVBL-UHFFFAOYSA-N
- CAS Registry Number: 4187-87-5
- Chemical structure:
View 3d structure (requires JavaScript / HTML 5) - Other names: Benzyl alcohol, α-ethynyl-; α-Ethynylbenzyl alcohol; α-Phenylpropargyl alcohol; Phenylethynylcarbinol; 1-Phenylpropargyl alcohol; 2-Propyn-1-ol, 1-phenyl-; 1-Phenyl-2-propyn-1-ol; 1-Phenyl-2-propyne-1-ol; Ethynylphenylcarbinol; NSC 4326; 1-phenylprop-2-yn-1-ol

Phase change data

Data compiled by: Robert L. Brown and Stephen E. Stein
Reduced pressure boiling point
Tboil (K) | Pressure (bar) | Reference |
---|---|---|
387. to 389. | 0.019 | Farchan Laboratories, 1990 |

Gas phase ion energetics data

Data compiled by: Sharon G. Lias, Rhoda D. Levin, and Sherif A. Kafafi
Ionization energy determinations
IE (eV) | Method | Reference | Comment |
---|---|---|---|
10.69 | PE | Andreocci, Bitchev, et al., 1979 | Vertical value |

References

Farchan Laboratories, 1990
Farchan Laboratories,
Research Chemicals Catalog, Farchan Laboratories, Gainesville, FL, 1990, 91. [all data]
Andreocci, Bitchev, et al., 1979
Andreocci, M.V.; Bitchev, P.; Carusi, P.; Furlani, A.,
Valence shell photoionization spectra of some substituted hydroxy-acetylenes. A tentative correlation with their cyclotrimerization reactions,
J. Electron Spectrosc. Relat. Phenom., 1979, 16, 25. [all data]