μ3-Methoxymethylidyne-tricobalt nonacarbonyl

Gas phase ion energetics data

Data compiled by: Sharon G. Lias, Rhoda D. Levin, and Sherif A. Kafafi

Ionization energy determinations

IE (eV) Method Reference Comment
7.4PEChesky and Hall, 1981
8.6PEChesky and Hall, 1981Vertical value

References

Chesky and Hall, 1981
Chesky, P.T.; Hall, M.B., Electronic structure of metal clusters. 1. Photoelectron spectra and molecular orbital calculations on (alkylidyne)tricobalt nonacarbonyl clusters, Inorg. Chem., 1981, 20, 4419. [all data]