Silane, isopropyl-trichloro-,
- Formula: C3H7Cl3Si
- Molecular weight: 177.532
- IUPAC Standard InChIKey: GPWLZOISJZHVHX-UHFFFAOYSA-N
- CAS Registry Number: 4170-46-1
- Chemical structure:
View 3d structure (requires JavaScript / HTML 5) - Other names: Trichloro(1-methylethyl)silane

Gas phase ion energetics data

Data compiled by: Henry M. Rosenstock, Keith Draxl, Bruce W. Steiner, and John T. Herron
Ionization energy determinations
IE (eV) | Method | Reference |
---|---|---|
10.3 ± 0.1 | EI | Steele, Nichols, et al., 1962 |
Appearance energy determinations
Ion | AE (eV) | Other Products | Method | Reference | Comment |
---|---|---|---|---|---|
C3H6+ | 10.92 | ? | EI | Steele, Nichols, et al., 1962 | |
C3H7+ | 11.4 ± 0.1 | ? | EI | Steele, Nichols, et al., 1962 | |
SiCl3+ | 13.1 ± 0.2 | ? | EI | Steele, Nichols, et al., 1962 |

References

Steele, Nichols, et al., 1962
Steele, W.C.; Nichols, L.D.; Stone, F.G.A.,
The determination of silicon-carbon and silicon-hydrogen bond dissociation energies by electron impact,
J. Am. Chem. Soc., 1962, 84, 4441. [all data]