Disulfide, 1,1-dimethylethyl ethyl
- Formula: C6H14S2
- Molecular weight: 150.305
- IUPAC Standard InChIKey: CLMXSBZIYJITQU-UHFFFAOYSA-N
- CAS Registry Number: 4151-69-3
- Chemical structure:
View 3d structure (requires JavaScript / HTML 5) - Species with the same structure:
- Other names: Disulfide, tert-butyl ethyl; tert-Butyl Ethyl disulfide; Ethyl tert-butyl disulfide; 2-Methyl-2-propyl ethyl disulfide; 2,2-Dimethyl-3,4-dithiahexane; Ethyl t-butyl disulfide

Phase change data

Data compiled as indicated in comments:
TRC - Thermodynamics Research Center, NIST Boulder Laboratories, Chris Muzny director
AC - William E. Acree, Jr., James S. Chickos
Quantity | Value | Units | Method | Reference | Comment |
---|---|---|---|---|---|
Tboil | 448. | K | N/A | Mcallan, Cullum, et al., 1951 | Uncertainty assigned by TRC = 1.5 K; TRC |
Quantity | Value | Units | Method | Reference | Comment |
Tfus | 206.4 | K | N/A | Mcallan, Cullum, et al., 1951 | Uncertainty assigned by TRC = 0.2 K; TRC |
Enthalpy of vaporization
ΔvapH (kJ/mol) | Temperature (K) | Method | Reference | Comment |
---|---|---|---|---|
43.4 | 388. | A,EB | Stephenson and Malanowski, 1987 | Based on data from 373. to 461. K. See also White, Barnard--Smith, et al., 1952 and Dykyj, Svoboda, et al., 1999.; AC |

Reaction thermochemistry data

Data compiled by: Hussein Y. Afeefy, Joel F. Liebman, and Stephen E. Stein
Individual Reactions
By formula: C8H18S2 + C4H10S2 = 2C6H14S2
Quantity | Value | Units | Method | Reference | Comment |
---|---|---|---|---|---|
ΔrH° | 0.0 ± 0.2 | kJ/mol | Eqk | Haraldson, Olander, et al., 1960 | liquid phase; solvent: Nonpolar solvent |

Gas phase ion energetics data

Data compiled by: Sharon G. Lias, John E. Bartmess, Joel F. Liebman, John L. Holmes, Rhoda D. Levin, and W. Gary Mallard
Ionization energy determinations
IE (eV) | Method | Reference |
---|---|---|
8.2 ± 0.8 | EI | Hawari, Griller, et al., 1986 |
Appearance energy determinations
Ion | AE (eV) | Other Products | Method | Reference | Comment |
---|---|---|---|---|---|
C2H5S2+ | 9.1 ± 0.8 | (CH3)3C | EI | Hawari, Griller, et al., 1986 |

Kovats' RI, non-polar column, isothermal

Column type | Active phase | Temperature (C) | I | Reference | Comment |
---|---|---|---|---|---|
Packed | Apiezon M | 130. | 1023. | Garbuzov, Misharina, et al., 1985 | He or N2, Chromosorb W, AW-DMCS; Column length: 2.1 m |

Normal alkane RI, non-polar column, custom temperature program

Column type | Active phase | I | Reference | Comment |
---|---|---|---|---|
Capillary | Apieson M | 1023. | Gao, Wang, et al., 2003 | Program: not specified |

Normal alkane RI, polar column, custom temperature program

Column type | Active phase | I | Reference | Comment |
---|---|---|---|---|
Capillary | PEG-1000 | 1299. | Gao, Wang, et al., 2003 | Program: not specified |

References

Mcallan, Cullum, et al., 1951
Mcallan, D.T.; Cullum, T.V.; Dean, R.A.; Fidler, F.A.,
The Preparation and Properties of Sulfur Compounds Related to Petroleum I. The Dialkyl Sulfides and Disulfides,
J. Am. Chem. Soc., 1951, 73, 3627-32. [all data]
Stephenson and Malanowski, 1987
Stephenson, Richard M.; Malanowski, Stanislaw,
Handbook of the Thermodynamics of Organic Compounds, 1987, https://doi.org/10.1007/978-94-009-3173-2
. [all data]
White, Barnard--Smith, et al., 1952
White, P.T.; Barnard--Smith, D.G.; Fidler, F.A.,
Vapor Pressure--Temperature Relationships of Sulfur Compounds Related to Petroleum,
Ind. Eng. Chem., 1952, 44, 6, 1430-1438, https://doi.org/10.1021/ie50510a064
. [all data]
Dykyj, Svoboda, et al., 1999
Dykyj, J.; Svoboda, J.; Wilhoit, R.C.; Frenkel, M.L.; Hall, K.R.,
Vapor Pressure of Chemicals: Part A. Vapor Pressure and Antoine Constants for Hydrocarbons and Sulfur, Selenium, Tellurium and Hydrogen Containing Organic Compounds, Springer, Berlin, 1999, 373. [all data]
Haraldson, Olander, et al., 1960
Haraldson, L.; Olander, C.J.; Sunner, S.; Varde, K.,
Equilibrium studies on the disproportionation reaction between some dialkyl disulfides,
Acta Chem. Scand., 1960, 14, 1509-1514. [all data]
Hawari, Griller, et al., 1986
Hawari, J.A.; Griller, D.; Lossing, F.P.,
Thermochemistry of perthiyl radicals,
J. Am. Chem. Soc., 1986, 108, 3273. [all data]
Bol'shakov, et al., 1969
Bol'shakov, G.F., et al.,
Ultraviolet spectra of heteroorganic compounds, 1969, 145. [all data]
Garbuzov, Misharina, et al., 1985
Garbuzov, V.G.; Misharina, T.A.; Aerov, A.F.; Golovnya, R.V.,
Gas chromatographic retention indices for sulphur(II)-containing organic substances,
J. Anal. Chem. USSR (Engl. Transl.), 1985, 40, 4, 576-586. [all data]
Gao, Wang, et al., 2003
Gao, Y.; Wang, Y.; Yao, X.; Zhang, X.; Liu, M.; Hu, Z.; Fan, B.,
The prediction for gas chromatographic retention index of disulfides on stationary phases of different polarity,
Talanta, 2003, 59, 2, 229-237, https://doi.org/10.1016/S0039-9140(02)00500-3
. [all data]