N,N-Dimethyl-p-ethyl-aniline
- Formula: C10H15N
- Molecular weight: 149.2328
- IUPAC Standard InChIKey: KLQNCSLBKKYPET-UHFFFAOYSA-N
- CAS Registry Number: 4150-37-2
- Chemical structure:
View 3d structure (requires JavaScript / HTML 5) - Other names: N,N-Dimethyl-4-ethylaniline

Gas phase ion energetics data

Data compiled by: Henry M. Rosenstock, Keith Draxl, Bruce W. Steiner, and John T. Herron
Ionization energy determinations
IE (eV) | Method | Reference |
---|---|---|
7.38 | CTS | Farrell and Newton, 1965 |

References

Farrell and Newton, 1965
Farrell, P.G.; Newton, J.,
Ionization potentials of aromatic amines,
J. Phys. Chem., 1965, 69, 3506. [all data]