3-Amino-1-phenyl-2-pyrazolin-5-one
- Formula: C9H9N3O
- Molecular weight: 175.1873
- IUPAC Standard InChIKey: LPOVZHYARSAVIZ-UHFFFAOYSA-N
- CAS Registry Number: 4149-06-8
- Chemical structure:
View 3d structure (requires JavaScript / HTML 5) - Other names: 3H-Pyrazol-3-one, 5-amino-2,4-dihydro-2-phenyl-; 1-Phenyl-3-amino-4,5-dihydropyrazol-5-on; 3-amino-1-phenyl-5-pyrazolone

Gas phase ion energetics data

Data compiled by: Sharon G. Lias and Joel F. Liebman
Ionization energy determinations
IE (eV) | Method | Reference | Comment |
---|---|---|---|
7.4 | PE | Vondrak, Bastl, et al., 1988 | |
7.70 | PE | Vondrak, Bastl, et al., 1988 | Vertical value |

References

Vondrak, Bastl, et al., 1988
Vondrak, T.; Bastl, Z.; Bohm, S.,
Gas-phase tautomerism in 2,4-dihydropyrazol-3-ones: An ultraviolet photoelectron spectroscopic study and MNDO molecular orbital calculations,
J. Am. Chem. Soc., 1988, 641. [all data]