Palladium, bis[(1,2,3-η)-2-methyl-2-propenyl]-
- Formula: C8H14Pd
- Molecular weight: 216.62
- IUPAC Standard InChIKey: BYEPMXFRQXXXLC-UHFFFAOYSA-N
- CAS Registry Number: 41348-25-8
- Chemical structure:
View 3d structure (requires JavaScript / HTML 5) - Other names: Palladium, bis[(1,2,3-η3)-2-methyl-2-propenyl]-

Gas phase ion energetics data

Data compiled by: Sharon G. Lias, Rhoda D. Levin, and Sherif A. Kafafi
Ionization energy determinations
IE (eV) | Method | Reference | Comment |
---|---|---|---|
7.33 | PE | Bohm, Gleiter, et al., 1980 | Vertical value |

References

Bohm, Gleiter, et al., 1980
Bohm, M.C.; Gleiter, R.; Batich, C.D.,
106. The photoelectron spectra of (Ni, Pd, Pt-Diallyl),
Helv. Chim. Acta, 1980, 63, 990. [all data]