1,3-Cyclopentadiene, 5,5-dimethyl-
- Formula: C7H10
- Molecular weight: 94.1543
- IUPAC Standard InChIKey: QWJWPDHACGGABF-UHFFFAOYSA-N
- CAS Registry Number: 4125-18-2
- Chemical structure:
View 3d structure (requires JavaScript / HTML 5) - Other names: 5,5-Dimethylcyclopentadiene

Gas phase thermochemistry data

Data compiled by: Hussein Y. Afeefy, Joel F. Liebman, and Stephen E. Stein
Quantity | Value | Units | Method | Reference | Comment |
---|---|---|---|---|---|
ΔfH°gas | 86.6 | kJ/mol | Chyd | Roth, Adamczak, et al., 1991 |

Reaction thermochemistry data

Data compiled by: Hussein Y. Afeefy, Joel F. Liebman, and Stephen E. Stein
Individual Reactions
By formula: 2H2 + C7H10 = C7H14
Quantity | Value | Units | Method | Reference | Comment |
---|---|---|---|---|---|
ΔrH° | -225. ± 0.4 | kJ/mol | Chyd | Roth, Klarner, et al., 1980 | liquid phase; solvent: Cyclohexane |
By formula: C7H10 = C7H10
Quantity | Value | Units | Method | Reference | Comment |
---|---|---|---|---|---|
ΔrH° | -179. ± 0.8 | kJ/mol | Ciso | Roth, Klarner, et al., 1980 | liquid phase; solvent: Heptane |

Gas phase ion energetics data

Data compiled as indicated in comments:
LBLHLM - Sharon G. Lias, John E. Bartmess, Joel F. Liebman, John L. Holmes, Rhoda D. Levin, and W. Gary Mallard
RDSH - Henry M. Rosenstock, Keith Draxl, Bruce W. Steiner, and John T. Herron
Ionization energy determinations
IE (eV) | Method | Reference | Comment |
---|---|---|---|
8.2 | PE | Guimon, Pfister-Guillouzo, et al., 1985 | LBLHLM |
8.22 ± 0.05 | EI | Meyer and Harrison, 1964 | RDSH |
8.45 | PE | Guimon, Pfister-Guillouzo, et al., 1985 | Vertical value; LBLHLM |
Appearance energy determinations
Ion | AE (eV) | Other Products | Method | Reference | Comment |
---|---|---|---|---|---|
C6H7+ | 10.75 | CH3 | EI | Harrison, Haynes, et al., 1965 | RDSH |

References

Roth, Adamczak, et al., 1991
Roth, W.R.; Adamczak, O.; Breuckmann, R.; Lennartz, H.-W.; Boese, R.,
Die Berechnung von Resonanzenergien; das MM2ERW-Kraftfeld,
Chem. Ber., 1991, 124, 2499-2521. [all data]
Roth, Klarner, et al., 1980
Roth, W.R.; Klarner, F.-G.; Lennartz, H.-W.,
Heats of hydrogenation. II. Heat of hydrogenation of bicyclo[2.1.0]pent-2-ene, an antiaromatic system,
Chem. Ber., 1980, 113, 1806-1818. [all data]
Guimon, Pfister-Guillouzo, et al., 1985
Guimon, C.; Pfister-Guillouzo, G.; Dubac, J.; Laporterie, A.; Manuel, G.; Iloughmane, H.,
Electronic structure of Group 14 (η4-metallole)tricarbonyliron complexes,
Organometallics, 1985, 4, 636. [all data]
Meyer and Harrison, 1964
Meyer, F.; Harrison, A.G.,
Ionization potentials of methyl-substituted benzenes and cyclopentadienes,
Can. J. Chem., 1964, 42, 2256. [all data]
Harrison, Haynes, et al., 1965
Harrison, A.G.; Haynes, P.; McLean, S.; Meyer, F.,
The mass spectra of methyl-substituted cyclopentadienes,
J. Am. Chem. Soc., 1965, 87, 5099. [all data]