1,3,5-Hexatriene, 2-methyl-, (E)-
- Formula: C7H10
- Molecular weight: 94.1543
- IUPAC Standard InChIKey: PPWGXYXJMQAWSX-AATRIKPKSA-N
- CAS Registry Number: 41233-72-1
- Chemical structure:
View 3d structure (requires JavaScript / HTML 5) - Permanent link for this species. Use this link for bookmarking this species for future reference.

Gas phase ion energetics data

Data compiled by: Sharon G. Lias, Rhoda D. Levin, and Sherif A. Kafafi
Appearance energy determinations
Ion | AE (eV) | Other Products | Method | Reference | Comment |
---|---|---|---|---|---|
C7H10+ | 8.31 | ? | PE | Astrup, Bock, et al., 1975 | Vertical value |

References

Astrup, Bock, et al., 1975
Astrup, E.E.; Bock, H.; Wittel, K.; Heimbach, P.,
Photoelectron spectra and molecular properties. LIII. Methyl-substituent effects on the hexatriene π system,
Acta Chem. Scand. Ser. A:, 1975, 29, 827. [all data]