1,4,8,11-Tetraazacyclotetradecane, 1,4,8,11-tetramethyl-
- Formula: C14H32N4
- Molecular weight: 256.4307
- IUPAC Standard InChIKey: HRFJEOWVAGSJNW-UHFFFAOYSA-N
- CAS Registry Number: 41203-22-9
- Chemical structure:
View 3d structure (requires JavaScript / HTML 5) - Other names: 1,4,8,11-Tetramethyl-1,4,8,11-tetraazacyclotetradecane; Tetramethylcyclam

Gas phase ion energetics data

Data compiled as indicated in comments:
LBLHLM - Sharon G. Lias, John E. Bartmess, Joel F. Liebman, John L. Holmes, Rhoda D. Levin, and W. Gary Mallard
Ionization energy determinations
IE (eV) | Method | Reference | Comment |
---|---|---|---|
8.0 | PE | Baker, Armen, et al., 1983 | Vertical value; LBLHLM |

References

Baker, Armen, et al., 1983
Baker, A.D.; Armen, G.H.; Funaro, S.,
Oral levels of crown ethers and related macrocycles studies by ultraviolet photoelectron spectroscopy: Relationship to complexation studies,
J. Chem. Soc. Dalton Trans., 1983, 2519. [all data]