1,3-Propanedione,2,2-dimethyl-1,3-diphenyl-
- Formula: C17H16O2
- Molecular weight: 252.3077
- IUPAC Standard InChIKey: ZCQWHDYGRXASIN-UHFFFAOYSA-N
- CAS Registry Number: 41169-42-0
- Chemical structure:
View 3d structure (requires JavaScript / HTML 5) - Other names: 2,2-Dimethyl-1,3-diphenyl-1,3-propanedione

Gas phase ion energetics data

Data compiled by: Sharon G. Lias, Rhoda D. Levin, and Sherif A. Kafafi
Ionization energy determinations
IE (eV) | Method | Reference | Comment |
---|---|---|---|
9.0 ± 0.05 | PE | McAlduff and Bunbury, 1979 | Vertical value |

References

McAlduff and Bunbury, 1979
McAlduff, E.J.; Bunbury, D.L.,
Photoelectron spectra of some aromatic mono-and di-ketones,
J. Electron Spectrosc. Relat. Phenom., 1979, 17, 81. [all data]