Naph[2,1,8,7:4,10,5]anthra[1,9,8-abcd]coronene
- Formula: C38H16
- Molecular weight: 472.5336
- IUPAC Standard InChIKey: BEWSIRCXMVBNRU-UHFFFAOYSA-N
- CAS Registry Number: 41163-25-1
- Chemical structure:
View 3d structure (requires JavaScript / HTML 5) - Other names: Naphth[2',1',8',7':4,10,5]anthra[1,9,8-abcd]coronene

Gas phase ion energetics data

Data compiled as indicated in comments:
LLK - Sharon G. Lias, Rhoda D. Levin, and Sherif A. Kafafi
Ionization energy determinations
IE (eV) | Method | Reference | Comment |
---|---|---|---|
6.81 ± 0.02 | PE | Clar and Schmidt, 1978 | Vertical value; LLK |
6.90 | PE | Clar and Schmidt, 1976 | Vertical value; LLK |

References

Clar and Schmidt, 1978
Clar, E.; Schmidt, W.,
Correlations between photoelectron and ultravioet absorption spectra of polycyclic hydrocarbons. The terrylene and peropyrene series,
Tetrahedron, 1978, 34, 3219. [all data]
Clar and Schmidt, 1976
Clar, E.; Schmidt, W.,
Correlations between photoelectron and phosphorescence spectra of polycyclic hydrocarbons,
Tetrahedron, 1976, 32, 2563. [all data]