Sulfide, ethyl propyl
- Formula: C5H12S
- Molecular weight: 104.214
- IUPAC Standard InChIKey: ZDDDFDQTSXYYSE-UHFFFAOYSA-N
- CAS Registry Number: 4110-50-3
- Chemical structure:
View 3d structure (requires JavaScript / HTML 5) - Other names: Propane, 1-(ethylthio)-; Ethyl propyl sulfide; Ethyl propyl thioether; Propyl ethyl sulfide; 3-Thiahexane; 1-(Ethylthio)propane; Ethyl propyl sulphide; n-C3H7SC2H5; Ethyl n-propyl sulfide

Gas phase thermochemistry data

Data compiled as indicated in comments:
ALS - Hussein Y. Afeefy, Joel F. Liebman, and Stephen E. Stein
DRB - Donald R. Burgess, Jr.
Quantity | Value | Units | Method | Reference | Comment |
---|---|---|---|---|---|
ΔfH°gas | -104.7 ± 0.79 | kJ/mol | Ccb | Geller, 1961 | ALS |
ΔfH°gas | -104.5 | kJ/mol | N/A | McCullough, Finke, et al., 1961 | Value computed using ΔfHliquid° value of -144.6±0.8 kj/mol from McCullough, Finke, et al., 1961 and ΔvapH° value of 40.1 kj/mol from Geller, 1961.; DRB |

Condensed phase thermochemistry data

Data compiled as indicated in comments:
ALS - Hussein Y. Afeefy, Joel F. Liebman, and Stephen E. Stein
DH - Eugene S. Domalski and Elizabeth D. Hearing
Quantity | Value | Units | Method | Reference | Comment |
---|---|---|---|---|---|
ΔfH°liquid | -144.8 ± 0.79 | kJ/mol | Ccb | Geller, 1961 | ALS |
ΔfH°liquid | -144.6 ± 0.75 | kJ/mol | Ccr | McCullough, Finke, et al., 1961 | ALS |
Quantity | Value | Units | Method | Reference | Comment |
ΔcH°liquid | -4139.9 ± 0.59 | kJ/mol | Ccb | Geller, 1961 | ALS |
ΔcH°liquid | -4139.5 ± 0.59 | kJ/mol | Ccr | McCullough, Finke, et al., 1961 | ALS |
Quantity | Value | Units | Method | Reference | Comment |
S°liquid | 309.53 | J/mol*K | N/A | McCullough, Finke, et al., 1961 | DH |
Constant pressure heat capacity of liquid
Cp,liquid (J/mol*K) | Temperature (K) | Reference | Comment |
---|---|---|---|
198.41 | 298.15 | McCullough, Finke, et al., 1961 | T = 11 to 370 K.; DH |

Phase change data

Data compiled as indicated in comments:
BS - Robert L. Brown and Stephen E. Stein
TRC - Thermodynamics Research Center, NIST Boulder Laboratories, Chris Muzny director
AC - William E. Acree, Jr., James S. Chickos
ALS - Hussein Y. Afeefy, Joel F. Liebman, and Stephen E. Stein
DRB - Donald R. Burgess, Jr.
DH - Eugene S. Domalski and Elizabeth D. Hearing
Quantity | Value | Units | Method | Reference | Comment |
---|---|---|---|---|---|
Tboil | 391.7 | K | N/A | Weast and Grasselli, 1989 | BS |
Tboil | 391.7 | K | N/A | Majer and Svoboda, 1985 | |
Tboil | 391.7 | K | N/A | Mcallan, Cullum, et al., 1951 | Uncertainty assigned by TRC = 0.3 K; TRC |
Tboil | 389. | K | N/A | Ingold, Jessop, et al., 1933 | Uncertainty assigned by TRC = 3. K; TRC |
Quantity | Value | Units | Method | Reference | Comment |
Tfus | 156.11 | K | N/A | Mcallan, Cullum, et al., 1951 | Uncertainty assigned by TRC = 0.1 K; TRC |
Quantity | Value | Units | Method | Reference | Comment |
Ttriple | 156.100 | K | N/A | McCullough, Finke, et al., 1961, 2 | Uncertainty assigned by TRC = 0.04 K; TRC |
Ttriple | 156.100 | K | N/A | McCullough, Finke, et al., 1961, 2 | Uncertainty assigned by TRC = 0.03 K; TRC |
Quantity | Value | Units | Method | Reference | Comment |
ΔvapH° | 40.0 ± 0.4 | kJ/mol | AVG | N/A | Average of 6 values; Individual data points |
Enthalpy of vaporization
ΔvapH (kJ/mol) | Temperature (K) | Method | Reference | Comment |
---|---|---|---|---|
39.8 | 308. | N/A | Dykyj, Svoboda, et al., 1999 | Based on data from 293. to 418. K.; AC |
37.8 | 346. | A,EB | Stephenson and Malanowski, 1987 | Based on data from 331. to 398. K. See also White, Barnard--Smith, et al., 1952.; AC |
34.24 | 391.7 | N/A | Majer and Svoboda, 1985 |
Enthalpy of fusion
ΔfusH (kJ/mol) | Temperature (K) | Reference | Comment |
---|---|---|---|
10.581 | 156.10 | McCullough, Finke, et al., 1961 | DH |
10.58 | 156.1 | Domalski and Hearing, 1996 | AC |
Entropy of fusion
ΔfusS (J/mol*K) | Temperature (K) | Reference | Comment |
---|---|---|---|
67.78 | 156.10 | McCullough, Finke, et al., 1961 | DH |

Gas phase ion energetics data

Data compiled as indicated in comments:
LLK - Sharon G. Lias, Rhoda D. Levin, and Sherif A. Kafafi
RDSH - Henry M. Rosenstock, Keith Draxl, Bruce W. Steiner, and John T. Herron
Ionization energy determinations
IE (eV) | Method | Reference | Comment |
---|---|---|---|
8.37 | CTS | Aloisi, Santini, et al., 1974 | LLK |
8.50 ± 0.05 | EI | Khvostenko and Furlei, 1968 | RDSH |

Kovats' RI, non-polar column, isothermal

Column type | Active phase | Temperature (C) | I | Reference | Comment |
---|---|---|---|---|---|
Packed | Apiezon M | 130. | 794. | Garbuzov, Misharina, et al., 1985 | He or N2, Chromosorb W, AW-DMCS; Column length: 2.1 m |
Packed | Apiezon M | 130. | 794. | Golovnya, Garbuzov, et al., 1976 | N2, Chromosorb W; Column length: 2.1 m |
Packed | Apiezon L | 130. | 801. | Martinu and Janák, 1970 |

Kovats' RI, polar column, isothermal

Column type | Active phase | Temperature (C) | I | Reference | Comment |
---|---|---|---|---|---|
Packed | Polyethylene Glycol | 130. | 1017. | Golovnya, Garbuzov, et al., 1976 | N2, Chromosorb W; Column length: 2.1 m |

Normal alkane RI, non-polar column, temperature ramp

Column type | Active phase | I | Reference | Comment |
---|---|---|---|---|
Capillary | DB-5 | 785. | Savel'eva, Zenkevich, et al., 2003 | 25. m/0.20 mm/0.33 μm, Helium, 40. C @ 1. min, 5. K/min, 270. C @ 15. min |

Normal alkane RI, non-polar column, custom temperature program

Column type | Active phase | I | Reference | Comment |
---|---|---|---|---|
Capillary | Polydimethyl siloxanes | 785. | Zenkevich, 1998 | Program: not specified |
Capillary | SE-52 | 782. | van Langenhove and Schamp, 1986 | Column length: 100. m; Column diameter: 0.50 mm; Program: not specified |
Capillary | OV-1, SE-30, Methyl silicone, SP-2100, OV-101, DB-1, etc. | 783. | Waggott and Davies, 1984 | Hydrogen; Column length: 50. m; Column diameter: 0.32 mm; Program: not specified |

References

Geller, 1961
Geller, B.E.,
Properties of the dimethylformamide water system. I. Thermochemical properties,
Russ. J. Phys. Chem. (Engl. Transl.), 1961, 35, 542-564. [all data]
McCullough, Finke, et al., 1961
McCullough, J.P.; Finke, H.L.; Hubbard, W.N.; Todd, S.S.; Messerly, J.F.; Douslin, D.R.; Waddington, G.,
Thermodynamic properties of four linear thiaalkanes,
J. Phys. Chem., 1961, 65, 784-791. [all data]
Weast and Grasselli, 1989
CRC Handbook of Data on Organic Compounds, 2nd Editon, Weast,R.C and Grasselli, J.G., ed(s)., CRC Press, Inc., Boca Raton, FL, 1989, 1. [all data]
Majer and Svoboda, 1985
Majer, V.; Svoboda, V.,
Enthalpies of Vaporization of Organic Compounds: A Critical Review and Data Compilation, Blackwell Scientific Publications, Oxford, 1985, 300. [all data]
Mcallan, Cullum, et al., 1951
Mcallan, D.T.; Cullum, T.V.; Dean, R.A.; Fidler, F.A.,
The Preparation and Properties of Sulfur Compounds Related to Petroleum I. The Dialkyl Sulfides and Disulfides,
J. Am. Chem. Soc., 1951, 73, 3627-32. [all data]
Ingold, Jessop, et al., 1933
Ingold; Jessop; Kuriyam; Mandour,
Influence of Poles and Polar Linkages on the Course Pursued by Elimination Reactions XVIII. Thermal Decompostion of Sulphoniumm Hydroxides,
J. Chem. Soc., 1933, 1933, 3455. [all data]
McCullough, Finke, et al., 1961, 2
McCullough, J.P.; Finke, H.L.; Hubbard, W.N.; Todd, S.S.; Messerly, J.F.; Douslin, D.R.; Waddington, G.,
Thermodynamic Properties of Four Linear Thiaalkanes,
J. Phys. Chem., 1961, 65, 784-91. [all data]
Dykyj, Svoboda, et al., 1999
Dykyj, J.; Svoboda, J.; Wilhoit, R.C.; Frenkel, M.L.; Hall, K.R.,
Vapor Pressure of Chemicals: Part A. Vapor Pressure and Antoine Constants for Hydrocarbons and Sulfur, Selenium, Tellurium and Hydrogen Containing Organic Compounds, Springer, Berlin, 1999, 373. [all data]
Stephenson and Malanowski, 1987
Stephenson, Richard M.; Malanowski, Stanislaw,
Handbook of the Thermodynamics of Organic Compounds, 1987, https://doi.org/10.1007/978-94-009-3173-2
. [all data]
White, Barnard--Smith, et al., 1952
White, P.T.; Barnard--Smith, D.G.; Fidler, F.A.,
Vapor Pressure--Temperature Relationships of Sulfur Compounds Related to Petroleum,
Ind. Eng. Chem., 1952, 44, 6, 1430-1438, https://doi.org/10.1021/ie50510a064
. [all data]
Domalski and Hearing, 1996
Domalski, Eugene S.; Hearing, Elizabeth D.,
Heat Capacities and Entropies of Organic Compounds in the Condensed Phase. Volume III,
J. Phys. Chem. Ref. Data, 1996, 25, 1, 1, https://doi.org/10.1063/1.555985
. [all data]
Aloisi, Santini, et al., 1974
Aloisi, G.G.; Santini, S.; Sorriso, S.,
Molecular complexes of substituted diphenyl sulphides with π acceptors. Charge transfer spectra and ionization potentials of the donors,
J. Chem. Soc. Faraday Trans. 1, 1974, 70, 1908. [all data]
Khvostenko and Furlei, 1968
Khvostenko, V.I.; Furlei, I.I.,
Ionisation potentials of sulphides,
Zh. Fiz. Khim., 1968, 42, 13, In original 5. [all data]
Garbuzov, Misharina, et al., 1985
Garbuzov, V.G.; Misharina, T.A.; Aerov, A.F.; Golovnya, R.V.,
Gas chromatographic retention indices for sulphur(II)-containing organic substances,
J. Anal. Chem. USSR (Engl. Transl.), 1985, 40, 4, 576-586. [all data]
Golovnya, Garbuzov, et al., 1976
Golovnya, R.V.; Garbuzov, V.G.; Misharina, T.A.,
Gas chromatographic characteristics of sulfur compounds. 2. Normal sulfides,
Izv. Akad. Nauk Kaz. SSR Ser. Khim., 1976, 10, 2266-2270. [all data]
Martinu and Janák, 1970
Martinu, V.; Janák, J.,
Gas-liquid chromatographic retention data of some aliphatic and alicyclic sulphides,
J. Chromatogr., 1970, 52, 69-75, https://doi.org/10.1016/S0021-9673(01)96545-8
. [all data]
Savel'eva, Zenkevich, et al., 2003
Savel'eva, E.I.; Zenkevich, I.G.; Radilov, A.S.,
Identification the Products of Chemical Neutralization of O-Isobutyl-S-(2-diethylaminoethyl)methylthiophosphonate in the Composition of Bitumen-Salt Matrices,
Zh. Anal. Khim. (Rus.), 2003, 58, 2, 135-145. [all data]
Zenkevich, 1998
Zenkevich, I.G.,
The Principle of Structural Analogy in the Calculation of Gas Chromatographic Retention Indices using Physico-Chemical Constants of Organic Compounds,
Zh. Anal. Khim. (Rus.), 1998, 53, 1, 43-49. [all data]
van Langenhove and Schamp, 1986
van Langenhove, H.; Schamp, N.,
Identification of Volatiles in the Head Space of Acid-Treated Phosphate Rock by Gas Chromatography-Mass Spectromety,
J. Chromatogr., 1986, 351, 65-75, https://doi.org/10.1016/S0021-9673(01)83473-7
. [all data]
Waggott and Davies, 1984
Waggott, A.; Davies, I.W.,
Identification of organic pollutants using linear temperature programmed retention indices (LTPRIs) - Part II, 1984, retrieved from http://dwi.defra.gov.uk/research/completed-research/reports/dwi0383.pdf. [all data]