cyclohex-3-en-1-one
- Formula: C6H8O
- Molecular weight: 96.1271
- IUPAC Standard InChIKey: VNLZLLDMKRKVEX-UHFFFAOYSA-N
- CAS Registry Number: 4096-34-8
- Chemical structure:
View 3d structure (requires JavaScript / HTML 5) - Other names: 3-Cyclohexen-1-one

Gas phase ion energetics data

Data compiled as indicated in comments:
LLK - Sharon G. Lias, Rhoda D. Levin, and Sherif A. Kafafi
Ionization energy determinations
IE (eV) | Method | Reference | Comment |
---|---|---|---|
9.42 | PE | Hentrich, Gunkel, et al., 1974 | Vertical value; LLK |

References

Hentrich, Gunkel, et al., 1974
Hentrich, G.; Gunkel, E.; Klessinger, M.,
Photoelektronenspektren organischer verbindungen. 4. Photoelektronenspektren ungesattigter carbonylverbindungen,
J. Mol. Struct., 1974, 21, 231. [all data]