Methylenecyclopropene
- Formula: C4H4
- Molecular weight: 52.0746
- IUPAC Standard InChIKey: GOSMMPKSWSOPRZ-UHFFFAOYSA-N
- CAS Registry Number: 4095-06-1
- Chemical structure:
View 3d structure (requires JavaScript / HTML 5) - Permanent link for this species. Use this link for bookmarking this species for future reference.

Gas phase ion energetics data

Data compiled as indicated in comments:
LL - Sharon G. Lias and Joel F. Liebman
Quantity | Value | Units | Method | Reference | Comment |
---|---|---|---|---|---|
ΔfH°(+) ion | 1210. | kJ/mol | N/A | N/A |
Ionization energy determinations
IE (eV) | Method | Reference | Comment |
---|---|---|---|
8.15 ± 0.03 | PE | Staley and Norden, 1989 | LL |
8.41 ± 0.05 | PE | Staley and Norden, 1989 | Vertical value; LL |

References

Staley and Norden, 1989
Staley, S.W.; Norden, T.D.,
Structure and energetics of C4H4+ in the gas phase. Photoelectron spectrum of methylenecyclopropene,
J. Am. Chem. Soc., 1989, 111, 445. [all data]