Bicyclo[4.2.1]nonane,9-methylene-
- Formula: C10H16
- Molecular weight: 136.2340
- IUPAC Standard InChIKey: KPGSQYHFBRXIDN-UHFFFAOYSA-N
- CAS Registry Number: 40916-48-1
- Chemical structure:
View 3d structure (requires JavaScript / HTML 5) - Permanent link for this species. Use this link for bookmarking this species for future reference.

Gas phase ion energetics data

Data compiled by: Sharon G. Lias, Rhoda D. Levin, and Sherif A. Kafafi
Ionization energy determinations
IE (eV) | Method | Reference | Comment |
---|---|---|---|
9.0 | PE | Reetz, Hoffmann, et al., 1973 | Vertical value |

References

Reetz, Hoffmann, et al., 1973
Reetz, M.T.; Hoffmann, R.W.; Schafer, W.; Schweig, A.,
Methylenebicyclo [4.2.1]nona-2,4,7-triene,
Angew. Chem. Int. Ed. Engl., 1973, 12, 81. [all data]