Tin,dimethylbis(2,4-pentanedionato-o,o')-(oc-6-21)-

Gas phase ion energetics data

Data compiled by: Sharon G. Lias, Rhoda D. Levin, and Sherif A. Kafafi

Ionization energy determinations

IE (eV) Method Reference Comment
8.35PEFragala, Ciliberto, et al., 1979Vertical value

References

Fragala, Ciliberto, et al., 1979
Fragala, I.; Ciliberto, E.; Finocchiaro, P.; Recca, A., He(I) and He(II) excited photoelectron spectra and electronic structure of 'pseudooctahedral' dichloro- and dimethyl-bis(pentane-2,4-dionato)tin(IV), J. Chem. Soc. Dalton Trans., 1979, 240. [all data]