Benzonitrile, 4-(chloroacetyl)-
- Formula: C9H6ClNO
- Molecular weight: 179.603
- IUPAC Standard InChIKey: LDHNCFIXYHXVDN-UHFFFAOYSA-N
- CAS Registry Number: 40805-50-3
- Chemical structure:
View 3d structure (requires JavaScript / HTML 5) - Permanent link for this species. Use this link for bookmarking this species for future reference.

Gas phase ion energetics data

Data compiled by: Sharon G. Lias, John E. Bartmess, Joel F. Liebman, John L. Holmes, Rhoda D. Levin, and W. Gary Mallard
Ionization energy determinations
IE (eV) | Method | Reference | Comment |
---|---|---|---|
10.1 | PE | Distefano, Granozzi, et al., 1987 | Vertical value |

References

Distefano, Granozzi, et al., 1987
Distefano, G.; Granozzi, G.; Olivato, P.R.; Guerrero, S.A.,
Hyperconjugative interactions in halogen-substituted carbonyls: Ultraviolet photoelectron spectroscopy of w-halogenoacetophenones,
J. Chem. Soc. Perkin Trans. 2, 1987, 1459. [all data]