2-Methoxy-1-phenyl-ethanone
- Formula: C9H10O2
- Molecular weight: 150.1745
- IUPAC Standard InChIKey: YRNDGUSDBCARGC-UHFFFAOYSA-N
- CAS Registry Number: 4079-52-1
- Chemical structure:
View 3d structure (requires JavaScript / HTML 5) - Other names: 2-Methoxyacetophenone; α-methoxyacetophenone

Phase change data

Data compiled by: Robert L. Brown and Stephen E. Stein
Reduced pressure boiling point
Tboil (K) | Pressure (bar) | Reference |
---|---|---|
395.7 | 0.024 | Aldrich Chemical Company Inc., 1990 |

Gas phase ion energetics data

Data compiled by: Henry M. Rosenstock, Keith Draxl, Bruce W. Steiner, and John T. Herron
Ionization energy determinations
IE (eV) | Method | Reference |
---|---|---|
8.60 ± 0.05 | EI | Pignataro, Foffani, et al., 1966 |

References

Aldrich Chemical Company Inc., 1990
Aldrich Chemical Company Inc.,
Catalog Handbook of Fine Chemicals, Aldrich Chemical Company, Inc., Milwaukee WI, 1990, 1. [all data]
Pignataro, Foffani, et al., 1966
Pignataro, S.; Foffani, A.; Innorta, G.; Distefano, G.,
Molecular structural effects on the ionization potentials for metasubstituted aromatic compounds and for compounds of the type X-CH2-R,
Z. Physik. Chem. (Frankfurt), 1966, 49, 291. [all data]