Benzene,1-methoxy-4-(3-phenylpropyl)-
- Formula: C16H18O
- Molecular weight: 226.3135
- IUPAC Standard InChIKey: SGNYZPBSYNTFID-UHFFFAOYSA-N
- CAS Registry Number: 40715-68-2
- Chemical structure:
View 3d structure (requires JavaScript / HTML 5) - Other names: 1-Phenyl-3-(4-methoxyphenyl)propane

Gas phase ion energetics data

Data compiled by: Sharon G. Lias, Rhoda D. Levin, and Sherif A. Kafafi
Ionization energy determinations
IE (eV) | Method | Reference |
---|---|---|
8.18 ± 0.05 | EI | Kuck and Grutzmacher, 1978 |
Appearance energy determinations
Ion | AE (eV) | Other Products | Method | Reference | Comment |
---|---|---|---|---|---|
C8H9O+ | 10.7 ± 0.1 | ? | EI | Kuck and Grutzmacher, 1978 |

References

Kuck and Grutzmacher, 1978
Kuck, D.; Grutzmacher, H.F.,
Hydrogen rearrangement in molecular ions of alkyl benzenes: appearance potentials and substituent effects on the formation of [C7H8]+ ions,
Org. Mass Spectrom., 1978, 13, 81. [all data]