Acetic acid, 2,2,2-trifluoroethyl ester
- Formula: C4H5F3O2
- Molecular weight: 142.0765
- IUPAC Standard InChIKey: ZOWSJJBOQDKOHI-UHFFFAOYSA-N
- CAS Registry Number: 406-95-1
- Chemical structure:
View 3d structure (requires JavaScript / HTML 5) - Permanent link for this species. Use this link for bookmarking this species for future reference.

Gas phase ion energetics data

Data compiled by: Sharon G. Lias, Rhoda D. Levin, and Sherif A. Kafafi
Ionization energy determinations
IE (eV) | Method | Reference |
---|---|---|
10.84 | PE | Sweigart and Turner, 1972 |

References

Sweigart and Turner, 1972
Sweigart, D.A.; Turner, D.W.,
Lone pair orbitals and their interactions studied by photoelectron spectroscopy. I. Carboxylic acids and their derivatives,
J. Am. Chem. Soc., 1972, 94, 5592. [all data]