Phenylcyclopentylamine
- Formula: C11H15N
- Molecular weight: 161.2435
- IUPAC Standard InChIKey: WEULTTCXSOUGPM-UHFFFAOYSA-N
- CAS Registry Number: 40649-26-1
- Chemical structure:
View 3d structure (requires JavaScript / HTML 5) - Other names: N-Cyclopentylaniline

Gas phase ion energetics data

Data compiled by: Henry M. Rosenstock, Keith Draxl, Bruce W. Steiner, and John T. Herron
Ionization energy determinations
IE (eV) | Method | Reference |
---|---|---|
7.45 | CTS | Briegleb and Czekalla, 1959 |

References

Briegleb and Czekalla, 1959
Briegleb, G.; Czekalla, J.,
Die Bestimmung von lonisierungsenergien aus den Spektren von Elektronenubergangskomplexen,
Z.Elektrochem., 1959, 63, 6. [all data]