2,2-Dimethylhydrazyl radical
- Formula: C2H7N2
- Molecular weight: 59.0904
- IUPAC Standard InChIKey: MUKURJUPGRIHBU-UHFFFAOYSA-N
- CAS Registry Number: 40613-93-2
- Chemical structure:
View 3d structure (requires JavaScript / HTML 5) - Permanent link for this species. Use this link for bookmarking this species for future reference.

Gas phase ion energetics data

Data compiled by: Henry M. Rosenstock, Keith Draxl, Bruce W. Steiner, and John T. Herron
Ionization energy determinations
IE (eV) | Method | Reference |
---|---|---|
6.4 ± 0.2 | EI | Foner and Hudson, 1970 |
6.6 ± 0.3 | EI | Foner and Hudson, 1962 |

References

Foner and Hudson, 1970
Foner, S.N.; Hudson, R.L.,
Mass spectrometric studies of atom-molecule reactions using high-intensity crossed molecular beams,
J. Chem. Phys., 1970, 53, 4377. [all data]
Foner and Hudson, 1962
Foner, S.N.; Hudson, R.L.,
Mass spectrometry of inorganic free radicals,
Advan. Chem. Ser., 1962, 36, 34. [all data]