Silane,trimethyl(3-phenyl-2-propenyl)-,(Z)-
- Formula: C12H18Si
- Molecular weight: 190.3568
- IUPAC Standard InChIKey: QSOKYXQHVHZSER-YFHOEESVSA-N
- CAS Registry Number: 40595-35-5
- Chemical structure:
View 3d structure (requires JavaScript / HTML 5) - Stereoisomers:

Gas phase ion energetics data

Data compiled by: Sharon G. Lias, Rhoda D. Levin, and Sherif A. Kafafi
Ionization energy determinations
IE (eV) | Method | Reference |
---|---|---|
7.77 ± 0.04 | EI | Benito, Seidl, et al., 1973 |

References

Benito, Seidl, et al., 1973
Benito, I.; Seidl, H.; Bock, H.,
Efectos electronicos y estericos de sustituyentes alquilicos y silicicos sobre el sistema electronico π del estireno,
Rev. Fac. Cienc. Univ. Oviedo, 1973, 14, 95. [all data]