1-Butene-3-yne, 4-iodo-
- Formula: C4H3I
- Molecular weight: 177.9711
- IUPAC Standard InChIKey: QWYPSOSNPXRMAA-UHFFFAOYSA-N
- CAS Registry Number: 40589-39-7
- Chemical structure:
View 3d structure (requires JavaScript / HTML 5) - Permanent link for this species. Use this link for bookmarking this species for future reference.

Gas phase ion energetics data

Data compiled by: Sharon G. Lias, Rhoda D. Levin, and Sherif A. Kafafi
Ionization energy determinations
IE (eV) | Method | Reference |
---|---|---|
8.94 ± 0.02 | PE | Brogli, Heilbronner, et al., 1975 |

References

Brogli, Heilbronner, et al., 1975
Brogli, F.; Heilbronner, E.; Wirz, J.; Kloster-Jensen, E.; Bergman, R.G.; Vollhardt, K.P.C.; Ashe, A.J., III,
The consequences of σ and π conjugative interactions in mono-, di- and triacetylenes. A photoelectron spectroscopic investigation,
Helv. Chim. Acta, 1975, 58, 2620. [all data]