5H-Benzocycloheptene,6,7,8,9-tetrahydro-5-methylene-
- Formula: C12H14
- Molecular weight: 158.2396
- IUPAC Standard InChIKey: FXXLVNARLGNNLX-UHFFFAOYSA-N
- CAS Registry Number: 40562-09-2
- Chemical structure:
View 3d structure (requires JavaScript / HTML 5) - Permanent link for this species. Use this link for bookmarking this species for future reference.

Gas phase ion energetics data

Data compiled by: Sharon G. Lias, Rhoda D. Levin, and Sherif A. Kafafi
Ionization energy determinations
IE (eV) | Method | Reference | Comment |
---|---|---|---|
8.45 ± 0.02 | PE | Maier and Turner, 1973 | Vertical value |

References

Maier and Turner, 1973
Maier, J.P.; Turner, D.W.,
Steric inhibition of resonance studied by molecular photoelectron spectroscopy. Part 2. Phenylethylenes,
J. Chem. Soc. Faraday Trans. 2, 1973, 69, 196. [all data]