1,3-Propanediol, 2-methyl-2-nitro-, dinitrate
- Formula: C4H7N3O8
- Molecular weight: 225.1137
- IUPAC Standard InChIKey: PNEVRNLRPGLOIP-UHFFFAOYSA-N
- CAS Registry Number: 4055-94-1
- Chemical structure:
View 3d structure (requires JavaScript / HTML 5) - Other names: 2-Nitro-2-methyl-1,3-propanediol dinitrate

Condensed phase thermochemistry data

Data compiled by: Hussein Y. Afeefy, Joel F. Liebman, and Stephen E. Stein
Quantity | Value | Units | Method | Reference | Comment |
---|---|---|---|---|---|
ΔfH°solid | -374. ± 2.2 | kJ/mol | Ccb | Medard and Thomas, 1954 | Heat of combustion corrected for pressure |
ΔfH°solid | -371.3 | kJ/mol | Ccb | Medard, 1954 | Heat of combustion corrected for pressure |
Quantity | Value | Units | Method | Reference | Comment |
ΔcH°solid | -2200. ± 2.2 | kJ/mol | Ccb | Medard and Thomas, 1954 | Heat of combustion corrected for pressure |
ΔcH°solid | -2203.2 | kJ/mol | Ccb | Medard, 1954 | Heat of combustion corrected for pressure |

References

Medard and Thomas, 1954
Medard, L.; Thomas, M.,
Chaleurs de combustion de vingt-quatre substances explosives ou apparentees a des explosifs,
Mem. Poudres, 1954, 36, 97-127. [all data]
Medard, 1954
Medard, L.,
Tables thermochimiques a l'usage des techniciens des substances explosives,
Mem. Artillerie Fr. Sci. Tech. Armement, 1954, 28, 415-492. [all data]