1-Acetoxy-4-fluorobenzene
- Formula: C8H7FO2
- Molecular weight: 154.1384
- IUPAC Standard InChIKey: ZNOREXRHKZXVPC-UHFFFAOYSA-N
- CAS Registry Number: 405-51-6
- Chemical structure:
View 3d structure (requires JavaScript / HTML 5) - Other names: Phenol,4-fluoro-,acetate; Phenol, 4-fluoro-, 1-acetate

Gas phase ion energetics data

Data compiled by: Sharon G. Lias, Rhoda D. Levin, and Sherif A. Kafafi
Ionization energy determinations
IE (eV) | Method | Reference |
---|---|---|
8.27 ± 0.03 | EI | Benezra and Bursey, 1971 |
Appearance energy determinations
Ion | AE (eV) | Other Products | Method | Reference | Comment |
---|---|---|---|---|---|
C2H3O+ | 12.72 ± 0.03 | C6H4FO | EI | Benezra and Bursey, 1971 | |
C6H5OF+ | 9.55 ± 0.03 | CH2=C=O | EI | Benezra and Bursey, 1971 |

References

Benezra and Bursey, 1971
Benezra, S.A.; Bursey, M.M.,
ortho-Effects on ordering factors in mass spectral rearrangements. Loss of keten from halogenated phenyl acetates and acetanilides,
J. Chem. Soc. B, 1971, 1515. [all data]